[Sisyphus-mipsel-reports] [#59161] sisyphus_mipsel FAILED srpm=ocaml-ssl-0.5.10-alt1.src.rpm

Girar awaiter robot awaiter at gyle-secondary.office.basealt.ru
Sat Mar 27 16:03:32 MSK 2021


2021-Mar-27 13:03:04 :: task #59161 for sisyphus_mipsel started by recycler:
#100 build ocaml-ssl-0.5.10-alt1.src.rpm
2021-Mar-27 13:03:06 :: [mipsel] #100 ocaml-ssl-0.5.10-alt1.src.rpm: build start
warning: Macro %dune_build not found
warning: Macro %dune_install not found
Reading Package Lists...
Building Dependency Tree...
E: Couldn't find package ocaml-findlib
hsh-install: Failed to calculate package file list.
hsh-install: Failed to generate package file list.
2021-Mar-27 13:03:32 :: [mipsel] ocaml-ssl-0.5.10-alt1.src.rpm: remote: cannot build src.rpm
2021-Mar-27 13:03:32 :: [mipsel] #100 ocaml-ssl-0.5.10-alt1.src.rpm: build FAILED
2021-Mar-27 13:03:32 :: [mipsel] requesting cancellation of task processing
2021-Mar-27 13:03:32 :: [mipsel] build FAILED
2021-Mar-27 13:03:32 :: task #59161 for sisyphus_mipsel FAILED

More information about the Sisyphus-mipsel-reports mailing list