[Sisyphus-mipsel-reports] [#59115] sisyphus_mipsel FAILED srpm=perl-Role-HasMessage-0.006-alt1.src.rpm

Girar awaiter robot awaiter at gyle-secondary.office.basealt.ru
Fri Mar 26 17:50:54 MSK 2021


2021-Mar-26 14:50:23 :: task #59115 for sisyphus_mipsel started by iv:
#100 build perl-Role-HasMessage-0.006-alt1.src.rpm
2021-Mar-26 14:50:25 :: [mipsel] #100 perl-Role-HasMessage-0.006-alt1.src.rpm: build start
<13>Mar 26 14:50:51 rpmi: libgdbm-1.8.3-alt10 sisyphus_mipsel+27978.100.1.1 1557334065 installed
<13>Mar 26 14:50:51 rpmi: libgdbm-devel-1.8.3-alt10 sisyphus_mipsel+27978.100.1.1 1557334065 installed
<13>Mar 26 14:50:51 rpmi: perl-devel-1:5.30.3-alt1 sisyphus_mipsel+51576.200.3.1 1602055688 installed
<13>Mar 26 14:50:51 rpmi: rpm-build-licenses-3.0.0-alt1 sisyphus_mipsel+37624.100.2.1 1575128035 installed
Reading Package Lists...
Building Dependency Tree...
MI2a: mark perl-MooseX-Role-Parameterized
MI2a:  target perl(Module/Runtime.pm)
MI2a:   mark perl-Module-Runtime
MI2a:  target perl(Moose.pm)
MI2a:   mark perl-Moose
MI2a:    target perl(Class/Load.pm)
MI2a:     mark perl-Class-Load
MI2a:      target perl(Data/OptList.pm)
MI2a:       mark perl-Data-OptList
MI2a:        target perl(Params/Util.pm)
MI2a:         mark perl-Params-Util
MI2a:        target perl(Sub/Install.pm)
MI2a:         mark perl-Sub-Install
MI2a:      target perl(Module/Implementation.pm)
MI2a:       mark perl-Module-Implementation
MI2a:        target perl(Try/Tiny.pm)
MI2a:         mark perl-Try-Tiny
MI2a:      target perl(Package/Stash.pm)
MI2a:       mark perl-Package-Stash
MI2a:        target perl-Package-Stash-XS
MI2a:         mark perl-Package-Stash-XS
MI2a:        target perl(Dist/CheckConflicts.pm)
MI2a:         mark perl-Dist-CheckConflicts
MI2a:    target perl(Devel/GlobalDestruction.pm)
MI2a:     mark perl-Devel-GlobalDestruction
MI2a:      target perl(Sub/Exporter/Progressive.pm)
MI2a:       mark perl-Sub-Exporter-Progressive
MI2a:    target perl(Devel/OverloadInfo.pm)
MI2a:     mark perl-Devel-OverloadInfo
MI2a:      target perl(MRO/Compat.pm)
MI2a:       mark perl-MRO-Compat
MI2a:      target perl(Sub/Identify.pm)
MI2a:       mark perl-Sub-Identify
MI2a:    target perl(Devel/StackTrace.pm)
MI2a:     mark perl-Devel-StackTrace
MI2a:    target perl(Eval/Closure.pm)
MI2a:     mark perl-Eval-Closure
MI2a:      target perl(Devel/LexAlias.pm)
MI2a:       mark perl-Devel-LexAlias
MI2a:        target perl(Devel/Caller.pm)
MI2a:         mark perl-Devel-Caller
MI2a:          target perl(PadWalker.pm)
MI2a:           mark perl-PadWalker
MI2a:    target perl(Filter/Simple.pm)
MI2a:     mark perl-Filter-Simple
MI2a:      target perl(Filter/Util/Call.pm)
MI2a:       mark perl-Filter
MI2a:      target perl(Text/Balanced.pm)
MI2a:       mark perl-Text-Balanced
MI2a:    target perl(Package/DeprecationManager.pm)
MI2a:     mark perl-Package-DeprecationManager
MI2a:      target perl(Sub/Name.pm)
MI2a:       mark perl-Sub-Name
MI2a:    target perl(Specio/Library/Builtins.pm)
MI2a:     mark perl-Specio
MI2a:      target perl(Role/Tiny.pm)
MI2a:       mark perl-Role-Tiny
MI2a:      target perl(Sub/Quote.pm)
MI2a:       mark perl-Sub-Quote
MI2a:      target perl(Test/Fatal.pm)
MI2a:       mark perl-Test-Fatal
MI2a:    target perl(Sub/Exporter.pm)
MI2a:     mark perl-Sub-Exporter
MI2a:      target perl(Package/Generator.pm)
MI2a:       mark perl-Package-Generator
MI2a:  target perl(namespace/autoclean.pm)
MI2a:   mark perl-namespace-autoclean
MI2a:    target perl(B/Hooks/EndOfScope.pm)
MI2a:     mark perl-B-Hooks-EndOfScope
MI2a:      target perl(Variable/Magic.pm)
MI2a:       mark perl-Variable-Magic
MI2a:    target perl(namespace/clean.pm)
MI2a:     mark perl-namespace-clean
rpm-build-licenses is already the newest version.
perl-devel is already the newest version.
E: Couldn't find package perl-String-Errf
hsh-install: Failed to calculate package file list.
hsh-install: Failed to generate package file list.
2021-Mar-26 14:50:54 :: [mipsel] perl-Role-HasMessage-0.006-alt1.src.rpm: remote: cannot build src.rpm
2021-Mar-26 14:50:54 :: [mipsel] #100 perl-Role-HasMessage-0.006-alt1.src.rpm: build FAILED
2021-Mar-26 14:50:54 :: [mipsel] requesting cancellation of task processing
2021-Mar-26 14:50:54 :: [mipsel] build FAILED
2021-Mar-26 14:50:54 :: task #59115 for sisyphus_mipsel FAILED

More information about the Sisyphus-mipsel-reports mailing list