[Sisyphus-mipsel-reports] [#65879] sisyphus_mipsel FAILED srpm=python3-module-tempest-19.0.0-alt3.src.rpm

Girar awaiter robot awaiter at gyle-secondary.office.basealt.ru
Thu Jul 8 19:19:40 MSK 2021


http://git.altlinux.org/tasks/65879/logs/events.1.1.log

2021-Jul-08 16:19:07 :: task #65879 for sisyphus_mipsel started by recycler:
#100 build python3-module-tempest-19.0.0-alt3.src.rpm
2021-Jul-08 16:19:09 :: [mipsel] #100 python3-module-tempest-19.0.0-alt3.src.rpm: build start
<13>Jul  8 16:19:34 rpmi: libgdbm-1.8.3-alt10 sisyphus_mipsel+64012.100.1.1 1624678967 installed
<13>Jul  8 16:19:34 rpmi: libexpat-2.2.10-alt1 sisyphus_mipsel+65143.100.2.1 1625409587 installed
<13>Jul  8 16:19:34 rpmi: libp11-kit-0.23.15-alt2 sisyphus_mipsel+46665.100.2.1 1591342786 installed
<13>Jul  8 16:19:34 rpmi: libtasn1-4.17.0-alt1 sisyphus_mipsel+65222.100.2.1 1625427753 installed
<13>Jul  8 16:19:34 rpmi: rpm-macros-alternatives-0.5.1-alt1 sisyphus_mipsel+65134.100.2.1 1625407413 installed
<13>Jul  8 16:19:34 rpmi: alternatives-0.5.1-alt1 sisyphus_mipsel+65134.100.2.1 1625407413 installed
<13>Jul  8 16:19:34 rpmi: ca-certificates-2020.06.29-alt1 sisyphus_mipsel+47950.300.1.1 1593513240 installed
<13>Jul  8 16:19:34 rpmi: ca-trust-0.1.2-alt1 sisyphus_mipsel+31443.100.2.1 1561717596 installed
<13>Jul  8 16:19:34 rpmi: p11-kit-trust-0.23.15-alt2 sisyphus_mipsel+46665.100.2.1 1591342786 installed
<13>Jul  8 16:19:34 rpmi: libcrypto1.1-1.1.1k-alt1 sisyphus_mipsel+59120.100.1.1 1616837987 installed
<13>Jul  8 16:19:34 rpmi: libssl1.1-1.1.1k-alt1 sisyphus_mipsel+59120.100.1.1 1616837987 installed
<13>Jul  8 16:19:34 rpmi: python3-3.9.6-alt1 sisyphus_mipsel+64896.100.1.1 1625096924 installed
<13>Jul  8 16:19:36 rpmi: python3-base-3.9.6-alt1 sisyphus_mipsel+64896.100.1.1 1625096924 installed
<13>Jul  8 16:19:37 rpmi: libpython3-3.9.6-alt1 sisyphus_mipsel+64896.100.1.1 1625096924 installed
<13>Jul  8 16:19:37 rpmi: tests-for-installed-python3-pkgs-0.1.17-alt1 sisyphus_mipsel+61761.300.1.1 1621848034 installed
<13>Jul  8 16:19:37 rpmi: rpm-build-python3-0.1.17-alt1 sisyphus_mipsel+61761.300.1.1 1621848034 installed
Reading Package Lists...
Building Dependency Tree...
MI2a: mark python3-dev
MI2a:  target libncurses-devel
MI2a:   mark libncurses-devel
MI2a:    target libtinfo-devel
MI2a:     mark libtinfo-devel
MI2a: mark python3-module-setuptools
MI2a:  target python3-module-pkg_resources
MI2a:   mark python3-module-pkg_resources
MI2a: mark python3-module-cliff
MI2a:  target python3(cmd2)
MI2a:   mark python3-module-cmd2
MI2a:    target python3(pyparsing)
MI2a:     mark python3-module-pyparsing
MI2a:  target python3(docutils)
MI2a:   mark python3-module-docutils
MI2a:    target python3(lxml)
MI2a:     mark python3-module-lxml
MI2a:      target python3-module-cssselect
MI2a:       mark python3-module-cssselect
MI2a:      target libexslt.so.0
MI2a:       mark libxslt
MI2a:      target python3(html5lib)
MI2a:       mark python3-module-html5lib
MI2a:        target python3(genshi.core)
MI2a:         mark python3-module-genshi
MI2a:        target python3(webencodings)
MI2a:         mark python3-module-webencodings
MI2a:  target python3(prettytable)
MI2a:   mark python3-module-prettytable
MI2a:    target python3(wcwidth)
MI2a:     mark python3-module-wcwidth
MI2a:  target python3(stevedore)
MI2a:   mark python3-module-stevedore
MI2a:    target python3(sphinx.util.nodes)
MI2a:     mark python3-module-sphinx
MI2a:      target python3(alabaster)
MI2a:       mark python3-module-alabaster
MI2a:        target python3(pygments.style)
MI2a:         mark python3-module-Pygments
MI2a:      target python3(requests)
MI2a:       mark python3-module-requests
MI2a:        target python3(chardet)
MI2a:         mark python3-module-chardet
MI2a:        target python3(idna)
MI2a:         mark python3-module-idna
MI2a:        target python3(urllib3)
MI2a:         mark python3-module-urllib3
MI2a:          target python3-module-ndg-httpsclient
MI2a:           mark python3-module-ndg-httpsclient
MI2a:            target python3(OpenSSL)
MI2a:             mark python3-module-openssl
MI2a:              target python3(cffi)
MI2a:               mark python3-module-cffi
MI2a:                target python3(pycparser)
MI2a:                 mark python3-module-pycparser
MI2a:              target python3(cryptography)
MI2a:               mark python3-module-cryptography
MI2a:            target python3-module-ndg
MI2a:             mark python3-module-ndg
MI2a:          target python3(ntlm)
MI2a:           mark python3-module-ntlm
MI2a:      target /usr/share/python-sphinx/objects.inv
MI2a:       mark python-sphinx-objects.inv
MI2a:      target python3(babel.dates)
MI2a:       mark python3-module-babel
MI2a:        target python3(pytz)
MI2a:         mark python3-module-pytz
MI2a:      target python3(imagesize)
MI2a:       mark python3-module-imagesize
MI2a:      target python3(jinja2)
MI2a:       mark python3-module-jinja2
MI2a:        target python3(markupsafe)
MI2a:         mark python3-module-markupsafe
MI2a:      target python3(packaging.specifiers)
MI2a:       mark python3-module-packaging
MI2a:      target python3(snowballstemmer)
MI2a:       mark python3-module-snowballstemmer
MI2a:      target python3(sphinxcontrib.applehelp)
MI2a:       mark python3-module-sphinxcontrib-applehelp
MI2a:      target python3(sphinxcontrib.devhelp)
MI2a:       mark python3-module-sphinxcontrib-devhelp
MI2a:      target python3(sphinxcontrib.htmlhelp)
MI2a:       mark python3-module-sphinxcontrib-htmlhelp
MI2a:      target python3(sphinxcontrib.jsmath)
MI2a:       mark python3-module-sphinxcontrib-jsmath
MI2a:      target python3(sphinxcontrib.qthelp)
MI2a:       mark python3-module-sphinxcontrib-qthelp
MI2a:      target python3(sphinxcontrib.serializinghtml)
MI2a:       mark python3-module-sphinxcontrib-serializinghtml
MI2a:    target python3-module-stevedore-tests
MI2a:     mark python3-module-stevedore-tests
MI2a:      target python3(mock)
MI2a:       mark python3-module-mock
MI2a:      target python3(testtools.matchers)
MI2a:       mark python3-module-testtools
MI2a:        target python3(traceback2)
MI2a:         mark python3-module-traceback2
MI2a:          target python3(linecache2)
MI2a:           mark python3-module-linecache2
MI2a:        target python3(mimeparse)
MI2a:         mark python3-module-mimeparse
MI2a:        target python3(extras)
MI2a:         mark python3-module-extras
MI2a:        target python3(fixtures)
MI2a:         mark python3-module-fixtures
MI2a:        target python3(testscenarios)
MI2a:         mark python3-module-testscenarios
MI2a:        target python3(twisted.internet)
MI2a:         mark python3-module-twisted-core
MI2a:          target python3(appdirs)
MI2a:           mark python3-module-appdirs
MI2a:          target python3(attr)
MI2a:           mark python3-module-attrs
MI2a:          target python3(automat)
MI2a:           mark python3-module-automat
MI2a:          target python3(gobject)
MI2a:           mark python3-module-pygobject
MI2a:          target python3(hyperlink)
MI2a:           mark python3-module-hyperlink
MI2a:          target python3(serial)
MI2a:           mark python3-module-serial
MI2a:            target python3(hid)
MI2a:             mark python3-module-cython-hidapi
MI2a:              target libhidapi-hidraw.so.0
MI2a:               mark libhidapi
MI2a:                target libusb-1.0.so.0
MI2a:                 mark libusb
MI2a:          target python3(zope.interface.adapter)
MI2a:           mark python3-module-zope.interface
MI2a:          target python3-module-twisted-logger
MI2a:           mark python3-module-twisted-logger
MI2a:            target python3(constantly)
MI2a:             mark python3-module-constantly
MI2a:          target python3-module-twisted-words
MI2a:           mark python3-module-twisted-words
MI2a:            target python3(incremental)
MI2a:             mark python3-module-incremental
MI2a:              target python3(click)
MI2a:               mark python3-module-click
MI2a:        target python3(unittest2)
MI2a:         mark python3-module-unittest2
MI2a:  target python3(yaml)
MI2a:   mark python3-module-yaml
MI2a:    target libyaml-0.so.2
MI2a:     mark libyaml2
MI2a: mark python3-module-jsonschema
MI2a:  target python3(pyrsistent)
MI2a:   mark python3-module-pyrsistent
MI2a: mark python3-module-paramiko
MI2a:  target python3(bcrypt)
MI2a:   mark python3-module-bcrypt
MI2a:  target python3(nacl.signing)
MI2a:   mark python3-module-pynacl
MI2a:    target libsodium.so.23
MI2a:     mark libsodium23
rpm-build-python3 is already the newest version.
Selecting python3-dev for 'python3-devel'
Selected version python3-module-pbr#5.5.1-alt3:sisyphus_mipsel+60621.100.1.1 at 1619551012 for python3-module-pbr>=2.0.0
Selected version python3-module-six#1.15.0-alt1:sisyphus_mipsel+49171.100.1.1 at 1596553107 for python3-module-six>=1.10.0
Selected version python3-module-cliff#2.14.1-alt1:sisyphus_mipsel+35853.300.1.1 at 1571392250 for python3-module-cliff>=2.8.0
Selected version python3-module-jsonschema#3.2.0-alt3:sisyphus_mipsel+64564.100.1.1 at 1624973985 for python3-module-jsonschema>=2.6.0
Version python3-module-testtools#2.4.0-alt1:sisyphus_mipsel+59416.100.2.1 at 1617300535 for python3-module-testtools>=2.2.0 is already selected for install
Selected version python3-module-paramiko#2.6.0-alt1:sisyphus_mipsel+35891.400.2.1 at 1571558797 for python3-module-paramiko>=2.0
Selected version python3-module-netaddr#0.7.19-alt2:sisyphus_mipsel+43531.200.2.1 at 1585725684 for python3-module-netaddr>=0.7.18
E: Couldn't find package python3-module-oslo.concurrency>=3.26.0
hsh-install: Failed to calculate package file list.
hsh-install: Failed to generate package file list.
2021-Jul-08 16:19:40 :: [mipsel] python3-module-tempest-19.0.0-alt3.src.rpm: remote: cannot build src.rpm
2021-Jul-08 16:19:40 :: [mipsel] #100 python3-module-tempest-19.0.0-alt3.src.rpm: build FAILED
2021-Jul-08 16:19:40 :: [mipsel] requesting cancellation of task processing
2021-Jul-08 16:19:40 :: [mipsel] build FAILED
2021-Jul-08 16:19:40 :: task #65879 for sisyphus_mipsel FAILED


More information about the Sisyphus-mipsel-reports mailing list