[Sisyphus-mipsel-reports] [#74609] sisyphus_mipsel FAILED srpm=freeipa-healthcheck-0.9-alt3.src.rpm

Girar awaiter robot awaiter at gyle-secondary.office.basealt.ru
Mon Dec 13 11:47:33 MSK 2021


http://git.altlinux.org/tasks/74609/logs/events.1.1.log

2021-Dec-13 08:44:22 :: task #74609 for sisyphus_mipsel started by recycler:
#100 build freeipa-healthcheck-0.9-alt3.src.rpm
2021-Dec-13 08:44:23 :: [mipsel] #100 freeipa-healthcheck-0.9-alt3.src.rpm: build start
==================================== ERRORS ====================================
____________ ERROR collecting tests/test_system_filesystemspace.py _____________
tests/test_system_filesystemspace.py:13: in <module>
--
    with open('/proc/1/sched', 'r') as sched:
E   FileNotFoundError: [Errno 2] No such file or directory: '/proc/1/sched'
=========================== short test summary info ============================
ERROR tests/test_system_filesystemspace.py - FileNotFoundError: [Errno 2] No ...
!!!!!!!!!!!!!!!!!!!! Interrupted: 1 error during collection !!!!!!!!!!!!!!!!!!!!
=============================== 1 error in 5.82s ===============================
ERROR: InvocationError for command /usr/src/RPM/BUILD/freeipa-healthcheck-0.9/.tox/py3/bin/python -m pytest (exited with code 2)
py3 finish: run-test  after 6.79 seconds
--
___________________________________ summary ____________________________________
ERROR:   py3: commands failed
  lint: commands succeeded
2021-Dec-13 08:47:33 :: [mipsel] freeipa-healthcheck-0.9-alt3.src.rpm: remote: build failed
2021-Dec-13 08:47:33 :: [mipsel] #100 freeipa-healthcheck-0.9-alt3.src.rpm: build FAILED
2021-Dec-13 08:47:33 :: [mipsel] requesting cancellation of task processing
2021-Dec-13 08:47:33 :: [mipsel] build FAILED
2021-Dec-13 08:47:33 :: task #74609 for sisyphus_mipsel FAILED


More information about the Sisyphus-mipsel-reports mailing list