[Sisyphus-mipsel-reports] [#60055] sisyphus_mipsel FAILED srpm=mk-configure-0.37.0-alt1.src.rpm

Girar awaiter robot awaiter at gyle-secondary.office.basealt.ru
Thu Apr 15 00:21:29 MSK 2021


2021-Apr-14 21:21:05 :: task #60055 for sisyphus_mipsel started by recycler:
#100 build mk-configure-0.37.0-alt1.src.rpm
2021-Apr-14 21:21:05 :: [mipsel] #100 mk-configure-0.37.0-alt1.src.rpm: build start
Reading Package Lists...
Building Dependency Tree...
MI2a: mark mk-files
MI2a:  target python3
MI2a:   mark python3
MI2a:    target python3-base
MI2a:     mark python3-base
MI2a:      target libcrypto.so.1.1
MI2a:       mark libcrypto1.1
MI2a:        target ca-certificates
MI2a:         mark ca-certificates
MI2a:          target ca-trust
MI2a:           mark ca-trust
MI2a:            target p11-kit-trust
MI2a:             mark p11-kit-trust
MI2a:              target /etc/alternatives/packages.d
MI2a:               mark alternatives
MI2a:                target rpm-macros-alternatives
MI2a:                 mark rpm-macros-alternatives
MI2a:              target libtasn1.so.6
MI2a:               mark libtasn1
MI2a:              target libp11-kit
MI2a:               mark libp11-kit
MI2a:      target libexpat.so.1
MI2a:       mark libexpat
MI2a:      target libgdbm.so.3
MI2a:       mark libgdbm
MI2a:      target libssl.so.1.1
MI2a:       mark libssl1.1
MI2a:    target libpython3
MI2a:     mark libpython3
MI2a: mark gcc-c++
MI2a:  target gcc9-c++
MI2a:   mark gcc9-c++
MI2a:    target libstdc++9-devel
MI2a:     mark libstdc++9-devel
MI2a:      target gcc-c++-common
MI2a:       mark gcc-c++-common
MI2a: mark glib2-devel
MI2a:  target rpm-build-gir
MI2a:   mark rpm-build-gir
MI2a:    target xml-utils
MI2a:     mark xml-utils
MI2a: mark libbsd-devel
MI2a:  target libbsd
MI2a:   mark libbsd
binutils is already the newest version.
bison is already the newest version.
E: Couldn't find package bmkdep
hsh-install: Failed to calculate package file list.
hsh-install: Failed to generate package file list.
2021-Apr-14 21:21:29 :: [mipsel] mk-configure-0.37.0-alt1.src.rpm: remote: cannot build src.rpm
2021-Apr-14 21:21:29 :: [mipsel] #100 mk-configure-0.37.0-alt1.src.rpm: build FAILED
2021-Apr-14 21:21:29 :: [mipsel] requesting cancellation of task processing
2021-Apr-14 21:21:29 :: [mipsel] build FAILED
2021-Apr-14 21:21:29 :: task #60055 for sisyphus_mipsel FAILED

More information about the Sisyphus-mipsel-reports mailing list