[Sisyphus-mipsel-reports] [#59878] sisyphus_mipsel FAILED srpm=gmic-2.9.7-alt1.src.rpm

Girar awaiter robot awaiter at gyle-secondary.office.basealt.ru
Mon Apr 12 02:47:31 MSK 2021


2021-Apr-11 22:27:31 :: task #59878 for sisyphus_mipsel started by recycler:
#100 build gmic-2.9.7-alt1.src.rpm
2021-Apr-11 22:27:31 :: [mipsel] #100 gmic-2.9.7-alt1.src.rpm: build start
echo skip strip gmic
skip strip gmic
make "CFLAGS+=-Dgmic_build -Dcimg_date=\\\"\\\" -Dcimg_time=\\\"\\\" -Dcimg_use_zlib -I.    -std=c++11 -pedantic -Wall -Wextra -Wfatal-errors -Werror=unknown-pragmas -Werror=unused-label -Wshadow -Dcimg_use_vt100 -Dcimg_use_abort -Dgmic_is_parallel -Dcimg_use_fftw3  -Dcimg_use_curl  -Dcimg_use_png -I/usr/include/libpng16 -Dcimg_use_jpeg -Dcimg_use_tiff  -fopenmp -Dcimg_use_openmp -Dcimg_display=1   -pipe -frecord-gcc-switches -Wall -g -O2" "LIBS+=-lz  -L/usr/lib -lm -lpthread -lfftw3 -lfftw3_threads -lcurl -lpng16 -lz -ljpeg -ltiff -lgomp -lX11 -lpthread  " _lib
make[1]: Entering directory '/usr/src/RPM/BUILD/gmic-2.9.7/src'
g++ -o libgmic.o -c gmic.cpp -fPIC -Dgmic_build -Dcimg_date=\"\" -Dcimg_time=\"\" -Dcimg_use_zlib -I.    -std=c++11 -pedantic -Wall -Wextra -Wfatal-errors -Werror=unknown-pragmas -Werror=unused-label -Wshadow -Dcimg_use_vt100 -Dcimg_use_abort -Dgmic_is_parallel -Dcimg_use_fftw3  -Dcimg_use_curl  -Dcimg_use_png -I/usr/include/libpng16 -Dcimg_use_jpeg -Dcimg_use_tiff  -fopenmp -Dcimg_use_openmp -Dcimg_display=1   -pipe -frecord-gcc-switches -Wall -g -O2
cc1plus: out of memory allocating 84236880 bytes after a total of 448512000 bytes
make[1]: *** [Makefile:438: libgmic.o] Error 1
make[1]: Leaving directory '/usr/src/RPM/BUILD/gmic-2.9.7/src'
make: *** [Makefile:426: lib] Error 2
make: Leaving directory '/usr/src/RPM/BUILD/gmic-2.9.7/src'
2021-Apr-11 23:47:30 :: [mipsel] gmic-2.9.7-alt1.src.rpm: remote: build failed
2021-Apr-11 23:47:30 :: [mipsel] #100 gmic-2.9.7-alt1.src.rpm: build FAILED
2021-Apr-11 23:47:30 :: [mipsel] requesting cancellation of task processing
2021-Apr-11 23:47:30 :: [mipsel] build FAILED
2021-Apr-11 23:47:30 :: task #59878 for sisyphus_mipsel FAILED

More information about the Sisyphus-mipsel-reports mailing list