[Sisyphus-mipsel-reports] [#59343] sisyphus_mipsel FAILED srpm=ocaml-ounit-2.2.4-alt2.src.rpm srpm=ocaml-qcheck-0.17-alt1.src.rpm

Girar awaiter robot awaiter at gyle-secondary.office.basealt.ru
Thu Apr 1 04:54:53 MSK 2021


2021-Apr-01 01:53:36 :: task #59343 for sisyphus_mipsel started by recycler:
#100 build ocaml-ounit-2.2.4-alt2.src.rpm
#200 build ocaml-qcheck-0.17-alt1.src.rpm
2021-Apr-01 01:53:53 :: created build repo
2021-Apr-01 01:53:56 :: [mipsel] #100 ocaml-ounit-2.2.4-alt2.src.rpm: build start
warning: Macro %dune_build not found
warning: Macro %dune_install not found
warning: Macro %dune_check not found
Reading Package Lists...
Building Dependency Tree...
E: Couldn't find package ocaml-findlib-devel
hsh-install: Failed to calculate package file list.
hsh-install: Failed to generate package file list.
2021-Apr-01 01:54:53 :: [mipsel] ocaml-ounit-2.2.4-alt2.src.rpm: remote: cannot build src.rpm
2021-Apr-01 01:54:53 :: [mipsel] #100 ocaml-ounit-2.2.4-alt2.src.rpm: build FAILED
2021-Apr-01 01:54:53 :: [mipsel] requesting cancellation of task processing
2021-Apr-01 01:54:53 :: [mipsel] build FAILED
2021-Apr-01 01:54:53 :: task #59343 for sisyphus_mipsel FAILED

More information about the Sisyphus-mipsel-reports mailing list