[Sisyphus-mipsel-reports] [#43061] sisyphus_mipsel FAILED srpm=python3-module-daemon-2.2.4-alt1.src.rpm

Girar awaiter robot awaiter at gyle-secondary.office.basealt.ru
Tue Mar 17 05:12:33 MSK 2020


http://git.altlinux.org/tasks/43061/logs/events.1.1.log

2020-Mar-17 02:12:00 :: task #43061 for sisyphus_mipsel started by recycler:
#100 build python3-module-daemon-2.2.4-alt1.src.rpm
2020-Mar-17 02:12:01 :: [mipsel] #100 python3-module-daemon-2.2.4-alt1.src.rpm: build start
<13>Mar 17 02:12:27 rpmi: libgdbm-1.8.3-alt10 sisyphus_mipsel+27978.100.1.1 1557334065 installed
<13>Mar 17 02:12:27 rpmi: libexpat-2.2.4-alt1 sisyphus_mipsel+27969.100.1.1 1557331072 installed
<13>Mar 17 02:12:27 rpmi: libp11-kit-0.23.15-alt1 sisyphus_mipsel+24967.100.1.1 1554317800 installed
<13>Mar 17 02:12:27 rpmi: libtasn1-4.16.0-alt1 sisyphus_mipsel+41171.100.2.1 1581676510 installed
<13>Mar 17 02:12:27 rpmi: rpm-macros-alternatives-0.5.1-alt1 sisyphus_mipsel+25713.100.2.1 1554890888 installed
<13>Mar 17 02:12:27 rpmi: alternatives-0.5.1-alt1 sisyphus_mipsel+25713.100.2.1 1554890888 installed
<13>Mar 17 02:12:27 rpmi: ca-certificates-2020.01.23-alt1 sisyphus_mipsel+42320.300.1.1 1582474446 installed
<13>Mar 17 02:12:27 rpmi: ca-trust-0.1.2-alt1 sisyphus_mipsel+31443.100.2.1 1561717596 installed
<13>Mar 17 02:12:27 rpmi: p11-kit-trust-0.23.15-alt1 sisyphus_mipsel+24967.100.1.1 1554317800 installed
<13>Mar 17 02:12:27 rpmi: libcrypto1.1-1.1.1d-alt1.1 sisyphus_mipsel+34861.100.1.1 1569241072 installed
<13>Mar 17 02:12:27 rpmi: libssl1.1-1.1.1d-alt1.1 sisyphus_mipsel+34861.100.1.1 1569241072 installed
<13>Mar 17 02:12:27 rpmi: python3-3.7.4-alt2 sisyphus_mipsel+36034.1000.5.1 1573678799 installed
<13>Mar 17 02:12:27 rpmi: libpython3-3.7.4-alt2 sisyphus_mipsel+36034.1000.5.1 1573678799 installed
<13>Mar 17 02:12:29 rpmi: python3-base-3.7.4-alt2 sisyphus_mipsel+36034.1000.5.1 1573678799 installed
<13>Mar 17 02:12:29 rpmi: tests-for-installed-python3-pkgs-0.1.13.1-alt2 1535451329 installed
<13>Mar 17 02:12:29 rpmi: rpm-build-python3-0.1.13.1-alt2 1535451329 installed
Reading Package Lists...
Building Dependency Tree...
MI2a: mark python3-module-docutils
MI2a:  target python3(lxml)
MI2a:   mark python3-module-lxml
MI2a:    target python3(cssselect)
MI2a:     mark python3-module-cssselect
MI2a:    target libexslt.so.0
MI2a:     mark libxslt
MI2a:      target libgcrypt.so.20
MI2a:       mark libgcrypt20
MI2a:        target libgpg-error
MI2a:         mark libgpg-error
MI2a:    target python3(html5lib)
MI2a:     mark python3-module-html5lib
MI2a:      target python3(genshi.core)
MI2a:       mark python3-module-genshi
MI2a:      target python3(six)
MI2a:       mark python3-module-six
MI2a:      target python3(webencodings)
MI2a:       mark python3-module-webencodings
rpm-build-python3 is already the newest version.
Selecting python3-module-docutils for 'python3(docutils)'
E: Couldn't find package python3(twine)
hsh-install: Failed to calculate package file list.
hsh-install: Failed to generate package file list.
2020-Mar-17 02:12:33 :: [mipsel] python3-module-daemon-2.2.4-alt1.src.rpm: remote: cannot build src.rpm
2020-Mar-17 02:12:33 :: [mipsel] #100 python3-module-daemon-2.2.4-alt1.src.rpm: build FAILED
2020-Mar-17 02:12:33 :: [mipsel] requesting cancellation of task processing
2020-Mar-17 02:12:33 :: [mipsel] build FAILED
2020-Mar-17 02:12:33 :: task #43061 for sisyphus_mipsel FAILED


More information about the Sisyphus-mipsel-reports mailing list