[Sisyphus-mipsel-reports] [#49820] p9_mipsel FAILED srpm=python-module-PySide2-5.12.6-alt1.src.rpm

Girar awaiter robot awaiter at gyle-secondary.office.basealt.ru
Tue Aug 25 08:13:02 MSK 2020


2020-Aug-25 05:03:23 :: task #49820 for p9_mipsel started by iv:
#100 build python-module-PySide2-5.12.6-alt1.src.rpm
2020-Aug-25 05:03:24 :: [mipsel] #100 python-module-PySide2-5.12.6-alt1.src.rpm: build start
qt.shiboken: (minimal) Unable to locate Clang's built-in include directory (neither by checking the environment variables LLVM_INSTALL_DIR, CLANG_INSTALL_DIR  nor running llvm-config). This may lead to parse errors.
/usr/lib/gcc/mipsel-alt-linux/8/../../../../include/c++/8/bits/cxxabi_init_exception.h:38:10: fatal error: 'stddef.h' file not found
(minimal) Errors in /usr/src/tmp/global_xtBNVL.hpp:
2020-Aug-25 05:13:01 :: [mipsel] python-module-PySide2-5.12.6-alt1.src.rpm: remote: build failed
2020-Aug-25 05:13:01 :: [mipsel] #100 python-module-PySide2-5.12.6-alt1.src.rpm: build FAILED
2020-Aug-25 05:13:02 :: [mipsel] requesting cancellation of task processing
2020-Aug-25 05:13:02 :: [mipsel] build FAILED
2020-Aug-25 05:13:02 :: task #49820 for p9_mipsel FAILED

More information about the Sisyphus-mipsel-reports mailing list