[Sisyphus-mipsel-reports] [#49567] sisyphus_mipsel FAILED srpm=spotifyd-0.22.4-alt3.src.rpm

Girar awaiter robot awaiter at gyle-secondary.office.basealt.ru
Wed Aug 19 11:08:24 MSK 2020


2020-Aug-19 07:55:01 :: task #49567 for sisyphus_mipsel started by recycler:
#100 build spotifyd-0.22.4-alt3.src.rpm
2020-Aug-19 07:55:02 :: [mipsel] #100 spotifyd-0.22.4-alt3.src.rpm: build start
    = note: this error originates in a macro (in Nightly builds, run with -Z macro-backtrace for more info)
error: aborting due to 2 previous errors
Some errors have detailed explanations: E0081, E0425.
For more information about an error, try `rustc --explain E0081`.
error: could not compile `nix`.
To learn more, run the command again with --verbose.
warning: build failed, waiting for other jobs to finish...
error: build failed
2020-Aug-19 08:08:23 :: [mipsel] spotifyd-0.22.4-alt3.src.rpm: remote: build failed
2020-Aug-19 08:08:23 :: [mipsel] #100 spotifyd-0.22.4-alt3.src.rpm: build FAILED
2020-Aug-19 08:08:23 :: [mipsel] requesting cancellation of task processing
2020-Aug-19 08:08:23 :: [mipsel] build FAILED
2020-Aug-19 08:08:23 :: task #49567 for sisyphus_mipsel FAILED

More information about the Sisyphus-mipsel-reports mailing list