[Sisyphus-mipsel-reports] [#49168] sisyphus_mipsel FAILED srpm=minetest-5.3.0-alt1.src.rpm

Girar awaiter robot awaiter at gyle-secondary.office.basealt.ru
Tue Aug 4 17:24:57 MSK 2020


2020-Aug-04 14:24:19 :: task #49168 for sisyphus_mipsel started by recycler:
#100 build minetest-5.3.0-alt1.src.rpm
2020-Aug-04 14:24:27 :: [mipsel] #100 minetest-5.3.0-alt1.src.rpm: build start
warning: Macro %cmake_insource not found
Reading Package Lists...
Building Dependency Tree...
MI2a: mark cmake
MI2a:  target libarchive.so.13
MI2a:   mark libarchive13
MI2a:    target libnettle.so.8
MI2a:     mark libnettle8
MI2a:  target libcurl.so.4
MI2a:   mark libcurl
MI2a:    target ca-certificates
MI2a:     mark ca-certificates
MI2a:      target ca-trust
MI2a:       mark ca-trust
MI2a:        target p11-kit-trust
MI2a:         mark p11-kit-trust
MI2a:          target /etc/alternatives/packages.d
MI2a:           mark alternatives
MI2a:            target rpm-macros-alternatives
MI2a:             mark rpm-macros-alternatives
MI2a:          target libtasn1.so.6
MI2a:           mark libtasn1
MI2a:          target libp11-kit
MI2a:           mark libp11-kit
MI2a:    target libbrotlidec.so.1
MI2a:     mark libbrotlidec
MI2a:      target libbrotlicommon
MI2a:       mark libbrotlicommon
MI2a:    target libcrypto.so.1.1
MI2a:     mark libcrypto1.1
MI2a:    target libgssapi_krb5.so.2
MI2a:     mark libkrb5
MI2a:      target libcom_err.so.2
MI2a:       mark libcom_err
MI2a:      target libkeyutils.so.1
MI2a:       mark libkeyutils
MI2a:      target liblmdb.so.0
MI2a:       mark liblmdb
MI2a:      target libssl.so.1.1
MI2a:       mark libssl1.1
MI2a:      target libverto.so.1
MI2a:       mark libverto
MI2a:    target libidn2.so.0
MI2a:     mark libidn2
MI2a:    target liblber-2.4.so.2
MI2a:     mark libldap
MI2a:      target libsasl2.so.3
MI2a:       mark libsasl2-3
MI2a:    target libnghttp2.so.14
MI2a:     mark libnghttp2
MI2a:    target libpsl.so.5
MI2a:     mark libpsl
MI2a:      target publicsuffix-list-dafsa
MI2a:       mark publicsuffix-list-dafsa
MI2a:  target libexpat.so.1
MI2a:   mark libexpat
MI2a:  target libjsoncpp.so.19
MI2a:   mark libjsoncpp19
MI2a:  target librhash.so.0
MI2a:   mark librhash
MI2a:  target libuv.so.1
MI2a:   mark libuv
MI2a:  target cmake-modules
MI2a:   mark cmake-modules
MI2a:    target dump
MI2a:     mark dump
MI2a:      target libe2p.so.2
MI2a:       mark libe2fs
MI2a:      target rmt
MI2a:       mark rmt
MI2a:  target rpm-macros-cmake
MI2a:   mark rpm-macros-cmake
MI2a: mark gcc-c++
MI2a:  target gcc9-c++
MI2a:   mark gcc9-c++
MI2a:    target libstdc++9-devel
MI2a:     mark libstdc++9-devel
MI2a:      target gcc-c++-common
MI2a:       mark gcc-c++-common
MI2a: mark libirrlicht-devel
MI2a:  target libirrlicht1
MI2a:   mark libirrlicht1
MI2a:    target libGL.so.1
MI2a:     mark libGL
MI2a:      target libGLX
MI2a:       mark libGLX
MI2a:        target libGLX-mesa
MI2a:         mark libGLX-mesa
MI2a:          target libX11-xcb.so.1
MI2a:           mark libX11
MI2a:            target libxcb.so.1
MI2a:             mark libxcb
MI2a:              target libXau.so.6
MI2a:               mark libXau
MI2a:              target libXdmcp.so.6
MI2a:               mark libXdmcp
MI2a:            target libX11-locales
MI2a:             mark libX11-locales
MI2a:          target libXdamage.so.1
MI2a:           mark libXdamage
MI2a:          target libXext.so.6
MI2a:           mark libXext
MI2a:          target libXfixes.so.3
MI2a:           mark libXfixes
MI2a:          target libXxf86vm.so.1
MI2a:           mark libXxf86vm
MI2a:          target libdrm.so.2
MI2a:           mark libdrm
MI2a:          target libxshmfence.so.1
MI2a:           mark libxshmfence
MI2a:        target libglvnd
MI2a:         mark libglvnd
MI2a:    target libjpeg.so.62
MI2a:     mark libjpeg
MI2a:    target libpng16.so.16
MI2a:     mark libpng16
Selected version cmake#3.18.1-alt1:sisyphus_mipsel+49040.100.1.1 at 1596143888 for cmake>=2.6.0
Selecting bzlib-devel for 'bzip2-devel'
E: Couldn't find package jthread-devel
hsh-install: Failed to calculate package file list.
hsh-install: Failed to generate package file list.
2020-Aug-04 14:24:57 :: [mipsel] minetest-5.3.0-alt1.src.rpm: remote: cannot build src.rpm
2020-Aug-04 14:24:57 :: [mipsel] #100 minetest-5.3.0-alt1.src.rpm: build FAILED
2020-Aug-04 14:24:57 :: [mipsel] requesting cancellation of task processing
2020-Aug-04 14:24:57 :: [mipsel] build FAILED
2020-Aug-04 14:24:57 :: task #49168 for sisyphus_mipsel FAILED

More information about the Sisyphus-mipsel-reports mailing list