[Sisyphus-mipsel-reports] [#49169] sisyphus_mipsel FAILED (try 2) srpm=gnustep-base-1.24.6-alt9.svn20140226.src.rpm ...

Girar awaiter robot awaiter at gyle-secondary.office.basealt.ru
Tue Aug 4 12:49:54 MSK 2020


2020-Aug-04 09:46:01 :: task #49169 for sisyphus_mipsel resumed by iv:
#100 build gnustep-base-1.24.6-alt9.svn20140226.src.rpm
#200 build gnustep-corebase-0.2-alt2.svn20140220.2.src.rpm
#300 build libdispatch-objc2-1.2-alt6.git20140226.src.rpm
#400 build gnustep-gui-0.24.0-alt8.svn20140223.src.rpm
2020-Aug-04 09:46:11 :: created build repo
2020-Aug-04 09:46:16 :: [mipsel] #100 gnustep-base-1.24.6-alt9.svn20140226.src.rpm: build start
2020-Aug-04 09:47:14 :: [mipsel] gnustep-base-1.24.6-alt9.svn20140226.src.rpm: remote: no need to rebuild
2020-Aug-04 09:47:14 :: [mipsel] #100 gnustep-base-1.24.6-alt9.svn20140226.src.rpm: build OK
2020-Aug-04 09:47:14 :: [mipsel] #200 gnustep-corebase-0.2-alt2.svn20140220.2.src.rpm: build start
2020-Aug-04 09:49:27 :: [mipsel] #200 gnustep-corebase-0.2-alt2.svn20140220.2.src.rpm: build OK
2020-Aug-04 09:49:27 :: [mipsel] #300 libdispatch-objc2-1.2-alt6.git20140226.src.rpm: build start
warning: Macro %cmake not found
warning: Macro %cmake_build not found
warning: Macro %cmakeinstall_std not found
Reading Package Lists...
Building Dependency Tree...
MI2a: mark clang7.0-devel
MI2a:  target clang7.0
MI2a:   mark clang7.0
MI2a:    target clang7.0-libs
MI2a:     mark clang7.0-libs
MI2a:      target llvm7.0-libs
MI2a:       mark llvm7.0-libs
MI2a: mark libBlocksRuntime-devel
MI2a:  target libBlocksRuntime
MI2a:   mark libBlocksRuntime
MI2a: mark cmake
MI2a:  target libarchive.so.13
MI2a:   mark libarchive13
MI2a:    target libnettle.so.8
MI2a:     mark libnettle8
MI2a:  target libcurl.so.4
MI2a:   mark libcurl
MI2a:    target ca-certificates
MI2a:     mark ca-certificates
MI2a:      target ca-trust
MI2a:       mark ca-trust
MI2a:        target p11-kit-trust
MI2a:         mark p11-kit-trust
MI2a:          target /etc/alternatives/packages.d
MI2a:           mark alternatives
MI2a:            target rpm-macros-alternatives
MI2a:             mark rpm-macros-alternatives
MI2a:          target libtasn1.so.6
MI2a:           mark libtasn1
MI2a:          target libp11-kit
MI2a:           mark libp11-kit
MI2a:    target libbrotlidec.so.1
MI2a:     mark libbrotlidec
MI2a:      target libbrotlicommon
MI2a:       mark libbrotlicommon
MI2a:    target libcrypto.so.1.1
MI2a:     mark libcrypto1.1
MI2a:    target libgssapi_krb5.so.2
MI2a:     mark libkrb5
MI2a:      target libcom_err.so.2
MI2a:       mark libcom_err
MI2a:      target libkeyutils.so.1
MI2a:       mark libkeyutils
MI2a:      target liblmdb.so.0
MI2a:       mark liblmdb
MI2a:      target libssl.so.1.1
MI2a:       mark libssl1.1
MI2a:      target libverto.so.1
MI2a:       mark libverto
MI2a:    target libidn2.so.0
MI2a:     mark libidn2
MI2a:    target liblber-2.4.so.2
MI2a:     mark libldap
MI2a:      target libsasl2.so.3
MI2a:       mark libsasl2-3
MI2a:    target libnghttp2.so.14
MI2a:     mark libnghttp2
MI2a:    target libpsl.so.5
MI2a:     mark libpsl
MI2a:      target publicsuffix-list-dafsa
MI2a:       mark publicsuffix-list-dafsa
MI2a:  target libexpat.so.1
MI2a:   mark libexpat
MI2a:  target libjsoncpp.so.19
MI2a:   mark libjsoncpp19
MI2a:  target librhash.so.0
MI2a:   mark librhash
MI2a:  target libuv.so.1
MI2a:   mark libuv
MI2a:  target cmake-modules
MI2a:   mark cmake-modules
MI2a:    target dump
MI2a:     mark dump
MI2a:      target libe2p.so.2
MI2a:       mark libe2fs
MI2a:      target rmt
MI2a:       mark rmt
MI2a:  target rpm-macros-cmake
MI2a:   mark rpm-macros-cmake
Selecting clang7.0-devel for 'clang-devel'
E: Couldn't find package libpthread_workqueue-devel
hsh-install: Failed to calculate package file list.
hsh-install: Failed to generate package file list.
2020-Aug-04 09:49:54 :: [mipsel] libdispatch-objc2-1.2-alt6.git20140226.src.rpm: remote: cannot build src.rpm
2020-Aug-04 09:49:54 :: [mipsel] #300 libdispatch-objc2-1.2-alt6.git20140226.src.rpm: build FAILED
2020-Aug-04 09:49:54 :: [mipsel] requesting cancellation of task processing
2020-Aug-04 09:49:54 :: [mipsel] build FAILED
2020-Aug-04 09:49:54 :: task #49169 for sisyphus_mipsel FAILED

More information about the Sisyphus-mipsel-reports mailing list