[Sisyphus-mipsel-reports] [#46420] sisyphus_mipsel FAILED (try 2) srpm=node-sass-4.14.1-alt2.src.rpm

Girar awaiter robot awaiter at gyle-secondary.office.basealt.ru
Tue Aug 4 07:40:03 MSK 2020


2020-Aug-04 04:39:31 :: task #46420 for sisyphus_mipsel resumed by recycler:
#100 build node-sass-4.14.1-alt2.src.rpm
2020-Aug-04 04:39:32 :: [mipsel] #100 node-sass-4.14.1-alt2.src.rpm: build start
<13>Aug  4 04:40:00 rpmi: rpm-build-compat-2.1.13-alt1 sisyphus_mipsel+40811.100.2.1 1580115042 installed
<13>Aug  4 04:40:00 rpmi: rpm-build-intro-2.1.13-alt1 sisyphus_mipsel+40811.100.2.1 1580115042 installed
<13>Aug  4 04:40:00 rpmi: rpm-macros-nodejs-0.20.4-alt2 sisyphus_mipsel+42224.100.1.1 1582317334 installed
warning: Macro %SOURCE2 not found
Reading Package Lists...
Building Dependency Tree...
MI2a: mark rpm-build-nodejs
MI2a:  target npm
MI2a:   mark npm
MI2a:    target curl
MI2a:     mark curl
MI2a:      target libcurl
MI2a:       mark libcurl
MI2a:        target ca-certificates
MI2a:         mark ca-certificates
MI2a:          target ca-trust
MI2a:           mark ca-trust
MI2a:            target p11-kit-trust
MI2a:             mark p11-kit-trust
MI2a:              target /etc/alternatives/packages.d
MI2a:               mark alternatives
MI2a:                target rpm-macros-alternatives
MI2a:                 mark rpm-macros-alternatives
MI2a:              target libtasn1.so.6
MI2a:               mark libtasn1
MI2a:              target libp11-kit
MI2a:               mark libp11-kit
MI2a:        target libbrotlidec.so.1
MI2a:         mark libbrotlidec
MI2a:          target libbrotlicommon
MI2a:           mark libbrotlicommon
MI2a:        target libcrypto.so.1.1
MI2a:         mark libcrypto1.1
MI2a:        target libgssapi_krb5.so.2
MI2a:         mark libkrb5
MI2a:          target libcom_err.so.2
MI2a:           mark libcom_err
MI2a:          target libkeyutils.so.1
MI2a:           mark libkeyutils
MI2a:          target liblmdb.so.0
MI2a:           mark liblmdb
MI2a:          target libssl.so.1.1
MI2a:           mark libssl1.1
MI2a:          target libverto.so.1
MI2a:           mark libverto
MI2a:        target libidn2.so.0
MI2a:         mark libidn2
MI2a:        target liblber-2.4.so.2
MI2a:         mark libldap
MI2a:          target libsasl2.so.3
MI2a:           mark libsasl2-3
MI2a:        target libnghttp2.so.14
MI2a:         mark libnghttp2
MI2a:        target libpsl.so.5
MI2a:         mark libpsl
MI2a:          target publicsuffix-list-dafsa
MI2a:           mark publicsuffix-list-dafsa
MI2a:    target git-core
MI2a:     mark git-core
MI2a:      target diffstat
MI2a:       mark diffstat
MI2a:      target less
MI2a:       mark less
MI2a:      target openssh-clients
MI2a:       mark openssh-clients
MI2a:        target libedit.so.3
MI2a:         mark libedit3
MI2a:        target openssh-common
MI2a:         mark openssh-common
MI2a:      target rsync
MI2a:       mark rsync
MI2a:      target libexpat.so.1
MI2a:       mark libexpat
MI2a:    target node
MI2a:     mark node
MI2a:      target openssl
MI2a:       mark openssl
MI2a:      target libcares.so.2
MI2a:       mark libcares
MI2a:      target libhttp_parser.so.2.9
MI2a:       mark libhttp-parser
MI2a:      target libicui18n.so.67
MI2a:       mark libicu67
MI2a:      target libuv.so.1
MI2a:       mark libuv
MI2a:    target zip
MI2a:     mark zip
MI2a:  target node-devel
MI2a:   mark node-devel
MI2a:    target gcc-c++
MI2a:     mark gcc-c++
MI2a:      target gcc9-c++
MI2a:       mark gcc9-c++
MI2a:        target libstdc++9-devel
MI2a:         mark libstdc++9-devel
MI2a:          target gcc-c++-common
MI2a:           mark gcc-c++-common
MI2a:    target zlib-devel
MI2a:     mark zlib-devel
MI2a:    target libcares-devel
MI2a:     mark libcares-devel
MI2a:    target openssl-devel
MI2a:     mark libssl-devel
MI2a:    target libuv-devel
MI2a:     mark libuv-devel
MI2a:  target node-gyp
MI2a:   mark node-gyp
MI2a:    target gyp
MI2a:     mark gyp
MI2a:      target python-modules
MI2a:       mark python-modules
MI2a:        target libgdbm.so.3
MI2a:         mark libgdbm
MI2a:        target python-modules-encodings
MI2a:         mark python-modules-encodings
MI2a:        target python-modules-compiler
MI2a:         mark python-modules-compiler
MI2a:        target python-modules-email
MI2a:         mark python-modules-email
MI2a:        target python-modules-unittest
MI2a:         mark python-modules-unittest
MI2a:        target python-modules-nis
MI2a:         mark python-modules-nis
MI2a:          target libnsl.so.2
MI2a:           mark libnsl2
MI2a:            target libtirpc.so.3
MI2a:             mark libtirpc
MI2a:      target python2.7(json)
MI2a:       mark python-modules-json
MI2a:      target python2.7(multiprocessing)
MI2a:       mark python-modules-multiprocessing
MI2a:        target python-modules-ctypes
MI2a:         mark python-modules-ctypes
MI2a:      target python2.7(pkg_resources)
MI2a:       mark python-module-pkg_resources
MI2a:      target python2.7(xml)
MI2a:       mark python-modules-xml
MI2a:  target /usr/bin/python3
MI2a:   mark python3
MI2a:    target python3-base
MI2a:     mark python3-base
MI2a:    target libpython3
MI2a:     mark libpython3
MI2a: mark libsass-devel
MI2a:  target libsass
MI2a:   mark libsass
Version rpm-build-intro#2.1.13-alt1:sisyphus_mipsel+40811.100.2.1 at 1580115042 for rpm-build-intro>=1.9.18 is already installed
rpm-build-intro is already the newest version.
rpm-macros-nodejs is already the newest version.
E: Couldn't find package node-nan
hsh-install: Failed to calculate package file list.
hsh-install: Failed to generate package file list.
2020-Aug-04 04:40:01 :: [mipsel] node-sass-4.14.1-alt2.src.rpm: remote: cannot build src.rpm
2020-Aug-04 04:40:02 :: [mipsel] #100 node-sass-4.14.1-alt2.src.rpm: build FAILED
2020-Aug-04 04:40:02 :: [mipsel] requesting cancellation of task processing
2020-Aug-04 04:40:02 :: [mipsel] build FAILED
2020-Aug-04 04:40:02 :: task #46420 for sisyphus_mipsel FAILED

More information about the Sisyphus-mipsel-reports mailing list