[Sisyphus-mipsel-reports] [#28298] sisyphus_mipsel FAILED srpm=docker-ce-18.09.6-alt1.src.rpm

Girar awaiter robot awaiter at gyle-secondary.office.basealt.ru
Thu May 9 02:37:22 MSK 2019


http://git.altlinux.org/tasks/28298/logs/events.1.1.log

2019-May-08 23:33:47 :: task #28298 for sisyphus_mipsel started by recycler:
#100 build docker-ce-18.09.6-alt1.src.rpm
2019-May-08 23:33:48 :: [mipsel] #100 docker-ce-18.09.6-alt1.src.rpm: build start
vendor/github.com/docker/docker/pkg/system/stat_linux.go:11:3: cannot use s.Rdev (type uint32) as type uint64 in field value
# github.com/docker/cli/vendor/github.com/containerd/continuity/sysx
vendor/github.com/containerd/continuity/sysx/xattr_linux.go:39:28: undefined: llistxattr
vendor/github.com/containerd/continuity/sysx/xattr_linux.go:46:9: undefined: lremovexattr
vendor/github.com/containerd/continuity/sysx/xattr_linux.go:53:9: undefined: lsetxattr
vendor/github.com/containerd/continuity/sysx/xattr_linux.go:60:33: undefined: lgetxattr
# github.com/docker/cli/vendor/github.com/docker/docker/pkg/signal
vendor/github.com/docker/docker/pkg/signal/signal_linux.go:35:14: undefined: unix.SIGSTKFLT
make: *** [Makefile:31: binary] Error 2
make: Leaving directory '/usr/src/RPM/BUILD/docker-ce-18.09.6/_build/src/github.com/docker/cli'
2019-May-08 23:37:20 :: [mipsel] docker-ce-18.09.6-alt1.src.rpm: remote: build failed
2019-May-08 23:37:20 :: [mipsel] #100 docker-ce-18.09.6-alt1.src.rpm: build FAILED
2019-May-08 23:37:20 :: [mipsel] requesting cancellation of task processing
2019-May-08 23:37:20 :: [mipsel] build FAILED
2019-May-08 23:37:20 :: task #28298 for sisyphus_mipsel FAILED


More information about the Sisyphus-mipsel-reports mailing list