[Sisyphus-mipsel-reports] [#30533] sisyphus_mipsel FAILED srpm=gpsbabel-1.5.4-alt3.src.rpm

Girar awaiter robot awaiter at gyle-secondary.office.basealt.ru
Sun Jun 16 14:55:51 MSK 2019


http://git.altlinux.org/tasks/30533/logs/events.1.1.log

2019-Jun-16 11:55:25 :: task #30533 for sisyphus_mipsel started by recycler:
#100 build gpsbabel-1.5.4-alt3.src.rpm
2019-Jun-16 11:55:26 :: [mipsel] #100 gpsbabel-1.5.4-alt3.src.rpm: build start
<13>Jun 16 11:55:49 rpmi: rpm-macros-ubt-0.3-alt1 sisyphus_mipsel+29971.100.1.1 1559552136 installed
<13>Jun 16 11:55:49 rpmi: rpm-build-ubt-0.3.1-alt3 sisyphus_mipsel+25555.100.1.1 1554649781 installed
warning: Macro %_qt5_translationdir not found
warning: Macro %_qt5_translationdir not found
Reading Package Lists...
Building Dependency Tree...
MI2a: mark libexpat-devel
MI2a:  target libexpat
MI2a:   mark libexpat
MI2a: mark libusb-devel
MI2a:  target libusb
MI2a:   mark libusb
MI2a: mark libminizip-devel
MI2a:  target libminizip
MI2a:   mark libminizip
MI2a: mark gcc-c++
MI2a:  target gcc8-c++
MI2a:   mark gcc8-c++
MI2a:    target libstdc++8-devel
MI2a:     mark libstdc++8-devel
MI2a:      target gcc-c++-common
MI2a:       mark gcc-c++-common
rpm-build-ubt is already the newest version.
E: Couldn't find package libshape-devel
hsh-install: Failed to calculate package file list.
hsh-install: Failed to generate package file list.
2019-Jun-16 11:55:50 :: [mipsel] gpsbabel-1.5.4-alt3.src.rpm: remote: cannot build src.rpm
2019-Jun-16 11:55:50 :: [mipsel] #100 gpsbabel-1.5.4-alt3.src.rpm: build FAILED
2019-Jun-16 11:55:51 :: [mipsel] requesting cancellation of task processing
2019-Jun-16 11:55:51 :: [mipsel] build FAILED
2019-Jun-16 11:55:51 :: task #30533 for sisyphus_mipsel FAILED


More information about the Sisyphus-mipsel-reports mailing list