[Sisyphus-mipsel-reports] [#6072] sisyphus_mipsel FAILED srpm=wammu-0.44-alt2.src.rpm
Girar awaiter robot
awaiter at gyle-secondary.office.basealt.ru
Wed Jun 27 17:59:11 MSK 2018
http://git.altlinux.org/tasks/6072/logs/events.1.1.log
2018-Jun-27 14:58:51 :: test-only task #6072 for sisyphus_mipsel started by recycler:
#100 build wammu-0.44-alt2.src.rpm
2018-Jun-27 14:58:51 :: [mipsel] #100 wammu-0.44-alt2.src.rpm: build start
Reading Package Lists...
Building Dependency Tree...
MI2a: mark python-dev
MI2a: target python
MI2a: mark python
MI2a: target python-modules-encodings
MI2a: mark python-modules-encodings
MI2a: target python-modules
MI2a: mark python-modules
MI2a: target libcrypto.so.10
MI2a: mark libcrypto10
MI2a: target ca-certificates
MI2a: mark ca-certificates
MI2a: target ca-trust
MI2a: mark ca-trust
MI2a: target p11-kit-trust
MI2a: mark p11-kit-trust
MI2a: target libp11-kit
MI2a: mark libp11-kit
MI2a: target libtasn1.so.6
MI2a: mark libtasn1
MI2a: target libgdbm.so.3
MI2a: mark libgdbm
MI2a: target libssl.so.10
MI2a: mark libssl10
MI2a: target libk5crypto.so.3
MI2a: mark libkrb5
MI2a: target libcom_err.so.2
MI2a: mark libcom_err
MI2a: target libkeyutils.so.1
MI2a: mark libkeyutils
MI2a: target libverto.so.1
MI2a: mark libverto
MI2a: target python-modules-compiler
MI2a: mark python-modules-compiler
MI2a: target python-modules-email
MI2a: mark python-modules-email
MI2a: target python-modules-unittest
MI2a: mark python-modules-unittest
MI2a: target python-modules-curses
MI2a: mark python-modules-curses
MI2a: target python-modules-xml
MI2a: mark python-modules-xml
MI2a: target libexpat.so.1
MI2a: mark libexpat
MI2a: target python-modules-hotshot
MI2a: mark python-modules-hotshot
MI2a: target python-modules-bsddb
MI2a: mark python-modules-bsddb
MI2a: target python-modules-logging
MI2a: mark python-modules-logging
MI2a: target python-modules-multiprocessing
MI2a: mark python-modules-multiprocessing
MI2a: target python-modules-ctypes
MI2a: mark python-modules-ctypes
MI2a: target libncurses-devel
MI2a: mark libncurses-devel
MI2a: target libtinfo-devel
MI2a: mark libtinfo-devel
Selected version python-dev#2.7.14-alt1 for python-devel>=2.7
E: Couldn't find package python-module-gammu>=0.10
hsh-install: Failed to calculate package file list.
hsh-install: Failed to generate package file list.
2018-Jun-27 14:59:11 :: [mipsel] wammu-0.44-alt2.src.rpm: remote: cannot build src.rpm
2018-Jun-27 14:59:11 :: [mipsel] #100 wammu-0.44-alt2.src.rpm: build FAILED
2018-Jun-27 14:59:11 :: [mipsel] build FAILED
2018-Jun-27 14:59:11 :: task #6072 for sisyphus_mipsel FAILED
More information about the Sisyphus-mipsel-reports
mailing list