[Sisyphus-mipsel-reports] [#6400] sisyphus_mipsel FAILED (try 2) srpm=elfutils-0.173-alt1.src.rpm

Girar awaiter robot awaiter at gyle-secondary.office.basealt.ru
Mon Aug 13 02:35:21 MSK 2018


http://git.altlinux.org/tasks/6400/logs/events.2.1.log

2018-Aug-12 23:28:31 :: task #6400 for sisyphus_mipsel resumed by recycler:
#100 build elfutils-0.173-alt1.src.rpm
2018-Aug-12 23:28:31 :: waiting for a shared lock on sisyphus_mipsel
2018-Aug-12 23:29:32 :: acquired a shared lock on sisyphus_mipsel
2018-Aug-12 23:29:32 :: [mipsel] #100 elfutils-0.173-alt1.src.rpm: build start
*** failure in /usr/src/RPM/BUILD/elfutils-0.173-alt1/build-mipsel-alt-linux/src/elflint --quiet --gnu-ld /usr/src/RPM/BUILD/elfutils-0.173-alt1/build-mipsel-alt-linux/src/strip.o
FAIL: run-varlocs-self.sh
/usr/src/RPM/BUILD/elfutils-0.173-alt1/build-mipsel-alt-linux/tests/varlocs: dwarf_cfi_addrframe 0x402008: no matching address range
--
*** failure in /usr/src/RPM/BUILD/elfutils-0.173-alt1/build-mipsel-alt-linux/tests/varlocs -e /usr/src/RPM/BUILD/elfutils-0.173-alt1/build-mipsel-alt-linux/src/strip.o
FAIL: run-exprlocs-self.sh
/usr/src/RPM/BUILD/elfutils-0.173-alt1/build-mipsel-alt-linux/tests/varlocs: dwarf_cfi_addrframe 0x402008: no matching address range
--
*** failure in /usr/src/RPM/BUILD/elfutils-0.173-alt1/build-mipsel-alt-linux/tests/varlocs --exprlocs -e /usr/src/RPM/BUILD/elfutils-0.173-alt1/build-mipsel-alt-linux/src/strip.o
FAIL: run-native-test.sh
/usr/src/RPM/BUILD/elfutils-0.173-alt1/build-mipsel-alt-linux/tests/allregs: dwfl_module_register_names: no backend registers known
--
# SKIP:  7
# XFAIL: 0
# FAIL:  6
# XPASS: 0
# ERROR: 0
See tests/test-suite.log
2018-Aug-12 23:35:21 :: [mipsel] elfutils-0.173-alt1.src.rpm: remote: build failed
2018-Aug-12 23:35:21 :: [mipsel] #100 elfutils-0.173-alt1.src.rpm: build FAILED
2018-Aug-12 23:35:21 :: [mipsel] build FAILED
2018-Aug-12 23:35:21 :: task #6400 for sisyphus_mipsel FAILED


More information about the Sisyphus-mipsel-reports mailing list