[Sisyphus-mipsel-reports] [#9415] sisyphus_mipsel FAILED srpm=perl-RPM-Source-Convert-0.665-alt1.src.rpm

Girar awaiter robot awaiter at gyle-secondary.office.basealt.ru
Sun Aug 12 05:10:01 MSK 2018


http://git.altlinux.org/tasks/9415/logs/events.1.1.log

2018-Aug-12 02:08:40 :: task #9415 for sisyphus_mipsel started by iv:
#100 build perl-RPM-Source-Convert-0.665-alt1.src.rpm
2018-Aug-12 02:08:40 :: waiting for a shared lock on sisyphus_mipsel
2018-Aug-12 02:09:13 :: acquired a shared lock on sisyphus_mipsel
2018-Aug-12 02:09:13 :: [mipsel] #100 perl-RPM-Source-Convert-0.665-alt1.src.rpm: build start
PERL_DL_NONLAZY=1 "/usr/bin/perl" "-MExtUtils::Command::MM" "-MTest::Harness" "-e" "undef *Test::Harness::Switches; test_harness(0, 'blib/lib', 'blib/arch')" t/*.t
Source::Shared::Resource::DistroMap does not define $Source::Shared::Resource::DistroMap::VERSION--version check failed at /usr/src/RPM/BUILD/RPM-Source-Convert-0.665/blib/lib/RPM/Source/Convert/Plugins/Generic2ALT.pm line 13.
BEGIN failed--compilation aborted at /usr/src/RPM/BUILD/RPM-Source-Convert-0.665/blib/lib/RPM/Source/Convert/Plugins/Generic2ALT.pm line 13.
Compilation failed in require at t/clean_scripts.t line 10.
BEGIN failed--compilation aborted at t/clean_scripts.t line 10.
t/clean_scripts.t .. 
--
Failed 12/12 subtests 
Source::Shared::Resource::DistroMap does not define $Source::Shared::Resource::DistroMap::VERSION--version check failed at /usr/src/RPM/BUILD/RPM-Source-Convert-0.665/blib/lib/RPM/Source/Convert/Plugins/Generic2ALT.pm line 13.
BEGIN failed--compilation aborted at /usr/src/RPM/BUILD/RPM-Source-Convert-0.665/blib/lib/RPM/Source/Convert/Plugins/Generic2ALT.pm line 13.
Compilation failed in require at /usr/src/RPM/BUILD/RPM-Source-Convert-0.665/blib/lib/RPM/Source/Convert/Plugins/Mageia2ALT.pm line 11.
BEGIN failed--compilation aborted at /usr/src/RPM/BUILD/RPM-Source-Convert-0.665/blib/lib/RPM/Source/Convert/Plugins/Mageia2ALT.pm line 11.
Compilation failed in require at t/mklibname.t line 8.
BEGIN failed--compilation aborted at t/mklibname.t line 8.
t/mklibname.t ...... 
--
Result: FAIL
Failed 2/2 test programs. 0/0 subtests failed.
make: *** [Makefile:856: test_dynamic] Error 255
2018-Aug-12 02:09:56 :: [mipsel] perl-RPM-Source-Convert-0.665-alt1.src.rpm: remote: build failed
2018-Aug-12 02:09:56 :: [mipsel] #100 perl-RPM-Source-Convert-0.665-alt1.src.rpm: build FAILED
2018-Aug-12 02:09:56 :: [mipsel] build FAILED
2018-Aug-12 02:09:57 :: task #9415 for sisyphus_mipsel FAILED


More information about the Sisyphus-mipsel-reports mailing list