[#433870] [test-only] FAILED lore.git=0.10.0-alt1
Girar awaiter (bogdanb)
girar-builder at altlinux.org
Tue Sep 22 13:11:50 MSK 2026
https://git.altlinux.org/tasks/433870/logs/events.1.1.log
https://packages.altlinux.org/tasks/433870
subtask name aarch64 i586 x86_64
#100 lore - - failed
2026-Sep-22 09:14:10 :: test-only task #433870 for sisyphus started by bogdanb:
#100 build 0.10.0-alt1 from /people/bogdanb/packages/lore.git fetched at 2026-Sep-22 09:14:08
2026-Sep-22 09:14:11 :: [x86_64] #100 lore.git 0.10.0-alt1: build start
2026-Sep-22 09:14:11 :: [aarch64] #100 lore.git 0.10.0-alt1: build start
2026-Sep-22 09:14:11 :: [i586] #100 lore.git 0.10.0-alt1: build start
2026-Sep-22 09:14:24 :: [i586] #100 lore.git 0.10.0-alt1: build SKIPPED
2026-Sep-22 09:14:34 :: [aarch64] #100 lore.git 0.10.0-alt1: build SKIPPED
[x86_64] test lore-server/src/hooks/traits.rs - hooks::traits::Hook (line 420) ... ok
[x86_64] test lore-server/src/hooks/traits.rs - hooks::traits::HookError::rejected (line 267) ... ok
[x86_64] test lore-server/src/hooks/traits.rs - hooks::traits (line 43) ... ok
[x86_64] test lore-server/src/hooks/mod.rs - hooks (line 91) ... ok
[x86_64] test lore-server/src/hooks/traits.rs - hooks::traits::HookError::rejected_default (line 294) ... ok
[x86_64] test lore-server/src/plugins/mod.rs - plugins (line 57) ... ok
[x86_64] --
[x86_64] test result: ok. 0 passed; 0 failed; 0 ignored; 0 measured; 0 filtered out; finished in 0.00s
[x86_64] error: 1 target failed:
[x86_64] `-p lore-storage --lib`
2026-Sep-22 10:11:49 :: [x86_64] lore.git 0.10.0-alt1: remote: build failed
2026-Sep-22 10:11:49 :: [x86_64] #100 lore.git 0.10.0-alt1: build FAILED
2026-Sep-22 10:11:49 :: [x86_64] requesting cancellation of task processing
2026-Sep-22 10:11:49 :: [x86_64] build FAILED
2026-Sep-22 10:11:50 :: task #433870 for sisyphus FAILED
More information about the Sisyphus-incominger
mailing list