[#436422] [test-only] FAILED (try 2) libgrokj2k.git=20.4.16-alt1

Girar awaiter (lav) girar-builder at altlinux.org
Sun Oct 11 16:03:53 MSK 2026


https://git.altlinux.org/tasks/436422/logs/events.2.1.log
https://packages.altlinux.org/tasks/436422

subtask  name        aarch64    i586  x86_64
    #40  libgrokj2k     1:41  failed    1:04

2026-Oct-11 13:02:10 :: test-only task #436422 for sisyphus resumed by lav:
#40 build 20.4.16-alt1 from /people/lav/packages/libgrokj2k.git fetched at 2026-Oct-11 13:02:08
#100 removed
2026-Oct-11 13:02:12 :: [x86_64] #40 libgrokj2k.git 20.4.16-alt1: build start
2026-Oct-11 13:02:12 :: [i586] #40 libgrokj2k.git 20.4.16-alt1: build start
2026-Oct-11 13:02:12 :: [aarch64] #40 libgrokj2k.git 20.4.16-alt1: build start
[i586] make[2]: Entering directory '/usr/src/RPM/BUILD/libgrokj2k-20.4.16'
[i586] [ 93%] Linking CXX shared library ../../../bin/libgrokj2kcodec.so
[i586] make[2]: Leaving directory '/usr/src/RPM/BUILD/libgrokj2k-20.4.16'
[i586] make[1]: Entering directory '/usr/src/RPM/BUILD/libgrokj2k-20.4.16'
[i586] [ 93%] Built target grokj2kcodec
[i586] make[1]: Leaving directory '/usr/src/RPM/BUILD/libgrokj2k-20.4.16'
[i586] make: *** [Makefile:166: all] Error 2
[i586] error: Bad exit status from /usr/src/tmp/rpmb-tmp.vIbkiU (%build)
[i586] RPM build errors:
[i586]     Bad exit status from /usr/src/tmp/rpmb-tmp.vIbkiU (%build)
2026-Oct-11 13:02:59 :: [i586] libgrokj2k.git 20.4.16-alt1: remote: build failed
2026-Oct-11 13:02:59 :: [i586] #40 libgrokj2k.git 20.4.16-alt1: build FAILED
2026-Oct-11 13:02:59 :: [i586] requesting cancellation of task processing
2026-Oct-11 13:03:16 :: [x86_64] #40 libgrokj2k.git 20.4.16-alt1: build OK
2026-Oct-11 13:03:53 :: [aarch64] #40 libgrokj2k.git 20.4.16-alt1: build OK
2026-Oct-11 13:02:59 :: [i586] build FAILED
2026-Oct-11 13:03:53 :: task #436422 for sisyphus FAILED


More information about the Sisyphus-incominger mailing list