[#412924] [test-only] FAILED (try 2) falcond.git=2.0.1-alt1
Girar awaiter (boria138)
girar-builder at altlinux.org
Sat Mar 28 12:40:16 MSK 2026
https://git.altlinux.org/tasks/412924/logs/events.2.1.log
https://packages.altlinux.org/tasks/412924
subtask name aarch64 i586 x86_64
#40 falcond failed - failed
2026-Mar-28 09:39:31 :: test-only task #412924 for sisyphus resumed by boria138:
#40 build 2.0.1-alt1 from /people/boria138/packages/falcond.git fetched at 2026-Mar-28 09:39:14
#100 removed
2026-Mar-28 09:39:32 :: [i586] #40 falcond.git 2.0.1-alt1: build start
2026-Mar-28 09:39:32 :: [aarch64] #40 falcond.git 2.0.1-alt1: build start
2026-Mar-28 09:39:32 :: [x86_64] #40 falcond.git 2.0.1-alt1: build start
2026-Mar-28 09:39:40 :: [i586] #40 falcond.git 2.0.1-alt1: build SKIPPED
[x86_64] + /usr/bin/zig build --verbose --release=safe -Dtarget=native -Dcpu=baseline -Doptimize=ReleaseSafe --system zig-cache --cache-dir zig-cache --global-cache-dir zig-cache
[x86_64] /usr/src/RPM/BUILD/falcond-2.0.1/falcond/build.zig.zon:25:14: error: package not found at 'zig-cache/otter_conf-1.0.0-d7vdxEWbAQDN62X7TrhhqEVu2kk-7okjqoB_7jZlKq34'
[x86_64] .hash = "otter_conf-1.0.0-d7vdxEWbAQDN62X7TrhhqEVu2kk-7okjqoB_7jZlKq34",
[x86_64] /usr/src/RPM/BUILD/falcond-2.0.1/falcond/build.zig.zon:29:14: error: package not found at 'zig-cache/otter_desktop-0.6.0-nwUfzVOXHABHzwAN1U0coV-Q4l0vft0CVasbYF1cX-sA'
[x86_64] .hash = "otter_desktop-0.6.0-nwUfzVOXHABHzwAN1U0coV-Q4l0vft0CVasbYF1cX-sA",
[x86_64] /usr/src/RPM/BUILD/falcond-2.0.1/falcond/build.zig.zon:33:14: error: package not found at 'zig-cache/otter_utils-0.5.0-DYWsu2CNAAA5Z4cIiM6TShCBppEf1lXoX2STVWM6JSgM'
[x86_64] .hash = "otter_utils-0.5.0-DYWsu2CNAAA5Z4cIiM6TShCBppEf1lXoX2STVWM6JSgM",
2026-Mar-28 09:40:03 :: [x86_64] falcond.git 2.0.1-alt1: remote: build failed
2026-Mar-28 09:40:03 :: [x86_64] #40 falcond.git 2.0.1-alt1: build FAILED
2026-Mar-28 09:40:03 :: [x86_64] requesting cancellation of task processing
[aarch64] + /usr/bin/zig build --verbose --release=safe -Dtarget=native -Dcpu=baseline -Doptimize=ReleaseSafe --system zig-cache --cache-dir zig-cache --global-cache-dir zig-cache
[aarch64] /usr/src/RPM/BUILD/falcond-2.0.1/falcond/build.zig.zon:25:14: error: package not found at 'zig-cache/otter_conf-1.0.0-d7vdxEWbAQDN62X7TrhhqEVu2kk-7okjqoB_7jZlKq34'
[aarch64] .hash = "otter_conf-1.0.0-d7vdxEWbAQDN62X7TrhhqEVu2kk-7okjqoB_7jZlKq34",
[aarch64] /usr/src/RPM/BUILD/falcond-2.0.1/falcond/build.zig.zon:29:14: error: package not found at 'zig-cache/otter_desktop-0.6.0-nwUfzVOXHABHzwAN1U0coV-Q4l0vft0CVasbYF1cX-sA'
[aarch64] .hash = "otter_desktop-0.6.0-nwUfzVOXHABHzwAN1U0coV-Q4l0vft0CVasbYF1cX-sA",
[aarch64] /usr/src/RPM/BUILD/falcond-2.0.1/falcond/build.zig.zon:33:14: error: package not found at 'zig-cache/otter_utils-0.5.0-DYWsu2CNAAA5Z4cIiM6TShCBppEf1lXoX2STVWM6JSgM'
[aarch64] .hash = "otter_utils-0.5.0-DYWsu2CNAAA5Z4cIiM6TShCBppEf1lXoX2STVWM6JSgM",
2026-Mar-28 09:40:15 :: [aarch64] falcond.git 2.0.1-alt1: remote: build failed
2026-Mar-28 09:40:15 :: [aarch64] #40 falcond.git 2.0.1-alt1: build FAILED
2026-Mar-28 09:40:03 :: [x86_64] build FAILED
2026-Mar-28 09:40:16 :: [aarch64] build FAILED
2026-Mar-28 09:40:16 :: task #412924 for sisyphus FAILED
More information about the Sisyphus-incominger
mailing list