[#412784] [test-only] FAILED srpm=v2rayN-7.18.0-alt1.src.rpm

Girar awaiter (serjigva) girar-builder at altlinux.org
Fri Mar 27 19:15:33 MSK 2026


https://git.altlinux.org/tasks/412784/logs/events.1.1.log
https://packages.altlinux.org/tasks/412784

subtask  name    aarch64  i586  x86_64
   #100  v2rayN   failed     -    1:39

2026-Mar-27 16:13:51 :: test-only task #412784 for sisyphus started by serjigva:
#100 build v2rayN-7.18.0-alt1.src.rpm
2026-Mar-27 16:13:53 :: [x86_64] #100 v2rayN-7.18.0-alt1.src.rpm: build start
2026-Mar-27 16:13:53 :: [i586] #100 v2rayN-7.18.0-alt1.src.rpm: build start
2026-Mar-27 16:13:53 :: [aarch64] #100 v2rayN-7.18.0-alt1.src.rpm: build start
2026-Mar-27 16:14:17 :: [i586] #100 v2rayN-7.18.0-alt1.src.rpm: build SKIPPED
[aarch64]   Determining projects to restore...
[aarch64] /usr/src/RPM/BUILD/v2rayN-7.18.0/v2rayN/ServiceLib/ServiceLib.csproj : error NU1101: Unable to find package Microsoft.NETCore.App.Runtime.linux-arm64. No packages exist with this id in source(s): local [/usr/src/RPM/BUILD/v2rayN-7.18.0/v2rayN/v2rayN.Desktop/v2rayN.Desktop.csproj]
[aarch64] /usr/src/RPM/BUILD/v2rayN-7.18.0/v2rayN/GlobalHotKeys/src/GlobalHotKeys/GlobalHotKeys.csproj : error NU1101: Unable to find package Microsoft.NETCore.App.Runtime.linux-arm64. No packages exist with this id in source(s): local [/usr/src/RPM/BUILD/v2rayN-7.18.0/v2rayN/v2rayN.Desktop/v2rayN.Desktop.csproj]
[aarch64] /usr/src/RPM/BUILD/v2rayN-7.18.0/v2rayN/v2rayN.Desktop/v2rayN.Desktop.csproj : error NU1101: Unable to find package Microsoft.NETCore.App.Runtime.linux-arm64. No packages exist with this id in source(s): local
[aarch64] /usr/src/RPM/BUILD/v2rayN-7.18.0/v2rayN/v2rayN.Desktop/v2rayN.Desktop.csproj : error NU1101: Unable to find package Microsoft.AspNetCore.App.Runtime.linux-arm64. No packages exist with this id in source(s): local
[aarch64] /usr/src/RPM/BUILD/v2rayN-7.18.0/v2rayN/ServiceLib/ServiceLib.csproj : error NU1101: Unable to find package Microsoft.AspNetCore.App.Runtime.linux-arm64. No packages exist with this id in source(s): local [/usr/src/RPM/BUILD/v2rayN-7.18.0/v2rayN/v2rayN.Desktop/v2rayN.Desktop.csproj]
[aarch64] /usr/src/RPM/BUILD/v2rayN-7.18.0/v2rayN/GlobalHotKeys/src/GlobalHotKeys/GlobalHotKeys.csproj : error NU1101: Unable to find package Microsoft.AspNetCore.App.Runtime.linux-arm64. No packages exist with this id in source(s): local [/usr/src/RPM/BUILD/v2rayN-7.18.0/v2rayN/v2rayN.Desktop/v2rayN.Desktop.csproj]
[aarch64]   Failed to restore /usr/src/RPM/BUILD/v2rayN-7.18.0/v2rayN/GlobalHotKeys/src/GlobalHotKeys/GlobalHotKeys.csproj (in 286 ms).
[aarch64]   Failed to restore /usr/src/RPM/BUILD/v2rayN-7.18.0/v2rayN/ServiceLib/ServiceLib.csproj (in 324 ms).
[aarch64]   Failed to restore /usr/src/RPM/BUILD/v2rayN-7.18.0/v2rayN/v2rayN.Desktop/v2rayN.Desktop.csproj (in 333 ms).
2026-Mar-27 16:15:28 :: [aarch64] v2rayN-7.18.0-alt1.src.rpm: remote: build failed
2026-Mar-27 16:15:28 :: [aarch64] #100 v2rayN-7.18.0-alt1.src.rpm: build FAILED
2026-Mar-27 16:15:29 :: [aarch64] requesting cancellation of task processing
2026-Mar-27 16:15:32 :: [x86_64] #100 v2rayN-7.18.0-alt1.src.rpm: build OK
2026-Mar-27 16:15:29 :: [aarch64] build FAILED
2026-Mar-27 16:15:33 :: task #412784 for sisyphus FAILED


More information about the Sisyphus-incominger mailing list