[#412488] [test-only] FAILED (try 2) openblas.git=0.3.32-alt1
Girar awaiter (iv)
girar-builder at altlinux.org
Tue Mar 24 22:10:33 MSK 2026
https://git.altlinux.org/tasks/412488/logs/events.2.1.log
https://packages.altlinux.org/tasks/412488
subtask name aarch64 i586 x86_64
#100 openblas failed 2:22 2:18
2026-Mar-24 19:06:41 :: test-only task #412488 for sisyphus resumed by iv:
#100 build 0.3.32-alt1 from /people/iv/packages/openblas.git fetched at 2026-Mar-24 17:24:16
2026-Mar-24 19:06:43 :: #100: force rebuild
2026-Mar-24 19:06:43 :: [aarch64] #100 openblas.git 0.3.32-alt1: build start
2026-Mar-24 19:06:43 :: [x86_64] #100 openblas.git 0.3.32-alt1: build start
2026-Mar-24 19:06:43 :: [i586] #100 openblas.git 0.3.32-alt1: build start
2026-Mar-24 19:09:01 :: [x86_64] #100 openblas.git 0.3.32-alt1: build OK
2026-Mar-24 19:09:05 :: [i586] #100 openblas.git 0.3.32-alt1: build OK
[aarch64] OPENBLAS_NUM_THREADS=2 ./xscblat3 < sin3
[aarch64] cblas_sgemm PASSED THE TESTS OF ERROR-EXITS
[aarch64] cblas_ssymm PASSED THE TESTS OF ERROR-EXITS
[aarch64] cblas_strmm PASSED THE TESTS OF ERROR-EXITS
[aarch64] cblas_strsm PASSED THE TESTS OF ERROR-EXITS
[aarch64] cblas_ssyrk PASSED THE TESTS OF ERROR-EXITS
[aarch64] cblas_ssyr2k PASSED THE TESTS OF ERROR-EXITS
[aarch64] TESTS OF THE REAL LEVEL 3 BLAS
[aarch64] --
[aarch64] OPENBLAS_NUM_THREADS=2 ./xdcblat3 < din3
[aarch64] cblas_dgemm PASSED THE TESTS OF ERROR-EXITS
[aarch64] cblas_dsymm PASSED THE TESTS OF ERROR-EXITS
[aarch64] cblas_dtrmm PASSED THE TESTS OF ERROR-EXITS
[aarch64] cblas_dtrsm PASSED THE TESTS OF ERROR-EXITS
[aarch64] cblas_dsyrk PASSED THE TESTS OF ERROR-EXITS
2026-Mar-24 19:10:33 :: [aarch64] openblas.git 0.3.32-alt1: remote: build failed
2026-Mar-24 19:10:33 :: [aarch64] #100 openblas.git 0.3.32-alt1: build FAILED
2026-Mar-24 19:10:33 :: [aarch64] requesting cancellation of task processing
2026-Mar-24 19:10:33 :: [aarch64] build FAILED
2026-Mar-24 19:10:33 :: task #412488 for sisyphus FAILED
More information about the Sisyphus-incominger
mailing list