[#412344] [test-only] FAILED jakarta-validation-api.git=3.1.0-alt1 sejda-commons.git=2.0.0-alt1 ...

Girar awaiter (alton) girar-builder at altlinux.org
Mon Mar 23 16:56:56 MSK 2026


https://git.altlinux.org/tasks/412344/logs/events.1.1.log
https://packages.altlinux.org/tasks/412344

subtask  name                    aarch64    i586  x86_64
   #100  jakarta-validation-api     1:07      33      33
   #200  sejda-commons                58      28      28
   #300  sejda-io                      ?  failed      29

2026-Mar-23 13:54:48 :: test-only task #412344 for sisyphus started by alton:
#100 build 3.1.0-alt1 from /people/alton/packages/jakarta-validation-api.git fetched at 2026-Mar-23 13:03:08
#200 build 2.0.0-alt1 from /people/alton/packages/sejda-commons.git fetched at 2026-Mar-23 13:04:32
#300 build 3.0.1-alt1 from /people/alton/packages/sejda-io.git fetched at 2026-Mar-23 13:51:39
2026-Mar-23 13:54:48 :: created build repo
2026-Mar-23 13:54:49 :: [aarch64] #100 jakarta-validation-api.git 3.1.0-alt1: build start
2026-Mar-23 13:54:49 :: [x86_64] #100 jakarta-validation-api.git 3.1.0-alt1: build start
2026-Mar-23 13:54:49 :: [i586] #100 jakarta-validation-api.git 3.1.0-alt1: build start
2026-Mar-23 13:55:22 :: [x86_64] #100 jakarta-validation-api.git 3.1.0-alt1: build OK
2026-Mar-23 13:55:22 :: [x86_64] #200 sejda-commons.git 2.0.0-alt1: build start
2026-Mar-23 13:55:22 :: [i586] #100 jakarta-validation-api.git 3.1.0-alt1: build OK
2026-Mar-23 13:55:23 :: [i586] #200 sejda-commons.git 2.0.0-alt1: build start
2026-Mar-23 13:55:50 :: [x86_64] #200 sejda-commons.git 2.0.0-alt1: build OK
2026-Mar-23 13:55:51 :: [x86_64] #300 sejda-io.git 3.0.1-alt1: build start
2026-Mar-23 13:55:51 :: [i586] #200 sejda-commons.git 2.0.0-alt1: build OK
2026-Mar-23 13:55:52 :: [i586] #300 sejda-io.git 3.0.1-alt1: build start
2026-Mar-23 13:55:56 :: [aarch64] #100 jakarta-validation-api.git 3.1.0-alt1: build OK
2026-Mar-23 13:55:57 :: [aarch64] #200 sejda-commons.git 2.0.0-alt1: build start
[i586] [ERROR] org.sejda.io.SeekableSourcesTest.aboveThresholdSeekableSourceFrom -- Time elapsed: 0.003 s <<< FAILURE!
[i586] org.opentest4j.AssertionFailedError: expected: <true> but was: <false>
[i586] 	at org.junit.jupiter.api.AssertionFailureBuilder.build(AssertionFailureBuilder.java:151)
2026-Mar-23 13:56:14 :: [i586] sejda-io.git 3.0.1-alt1: remote: build failed
2026-Mar-23 13:56:14 :: [i586] #300 sejda-io.git 3.0.1-alt1: build FAILED
2026-Mar-23 13:56:14 :: [i586] requesting cancellation of task processing
2026-Mar-23 13:56:20 :: [x86_64] #300 sejda-io.git 3.0.1-alt1: build OK
2026-Mar-23 13:56:55 :: [aarch64] #200 sejda-commons.git 2.0.0-alt1: build OK
2026-Mar-23 13:56:55 :: [aarch64] task processing CANCELLED
2026-Mar-23 13:56:14 :: [i586] build FAILED
2026-Mar-23 13:56:56 :: [aarch64] build FAILED
2026-Mar-23 13:56:56 :: task #412344 for sisyphus FAILED


More information about the Sisyphus-incominger mailing list