[#412063] [test-only] FAILED (try 2) spdk.git=26.01-alt1
Girar awaiter (lvol)
girar-builder at altlinux.org
Mon Mar 23 14:54:17 MSK 2026
https://git.altlinux.org/tasks/412063/logs/events.2.1.log
https://packages.altlinux.org/tasks/412063
subtask name aarch64 i586 x86_64
#40 spdk failed - 2:57
2026-Mar-23 11:51:18 :: test-only task #412063 for sisyphus resumed by lvol:
#40 build 26.01-alt1 from /people/lvol/packages/spdk.git fetched at 2026-Mar-23 11:50:54
#100 removed
2026-Mar-23 11:51:20 :: [x86_64] #40 spdk.git 26.01-alt1: build start
2026-Mar-23 11:51:20 :: [aarch64] #40 spdk.git 26.01-alt1: build start
2026-Mar-23 11:51:20 :: [i586] #40 spdk.git 26.01-alt1: build start
2026-Mar-23 11:51:26 :: [i586] #40 spdk.git 26.01-alt1: build SKIPPED
[aarch64] IMPLEMENT_MH_SHA1 1
[aarch64] <instantiation>:1:11: error: macros cannot be nested more than 20 levels deep. Use -asm-macro-max-nesting-depth to increase this limit.
[aarch64] exec_step 77
[aarch64] --
[aarch64] IMPLEMENT_MH_SHA1 1
[aarch64] <instantiation>:3:14: error: macros cannot be nested more than 20 levels deep. Use -asm-macro-max-nesting-depth to increase this limit.
[aarch64] exec_steps 78,79
2026-Mar-23 11:52:57 :: [aarch64] spdk.git 26.01-alt1: remote: build failed
2026-Mar-23 11:52:57 :: [aarch64] #40 spdk.git 26.01-alt1: build FAILED
2026-Mar-23 11:52:57 :: [aarch64] requesting cancellation of task processing
2026-Mar-23 11:54:17 :: [x86_64] #40 spdk.git 26.01-alt1: build OK
2026-Mar-23 11:52:58 :: [aarch64] build FAILED
2026-Mar-23 11:54:17 :: task #412063 for sisyphus FAILED
More information about the Sisyphus-incominger
mailing list