[#412311] FAILED (try 2) python3-module-deepmerge.git=2.0-alt1 zensical.git=0.0.28-alt1

Girar awaiter (ancieg) girar-builder at altlinux.org
Mon Mar 23 12:38:33 MSK 2026


https://git.altlinux.org/tasks/412311/logs/events.2.1.log
https://packages.altlinux.org/tasks/412311

subtask  name      aarch64    i586  x86_64
   #300  zensical   failed  failed  failed

2026-Mar-23 09:36:05 :: task #412311 for sisyphus resumed by ancieg:
#100 build 2.0-alt1 from /people/ancieg/packages/python3-module-deepmerge.git fetched at 2026-Mar-23 08:54:25
#200 removed
#300 build 0.0.28-alt1 from /people/ancieg/packages/zensical.git fetched at 2026-Mar-23 09:36:03
2026-Mar-23 09:36:06 :: created build repo
2026-Mar-23 09:36:08 :: [i586] #100 python3-module-deepmerge.git 2.0-alt1: build start
2026-Mar-23 09:36:08 :: [x86_64] #100 python3-module-deepmerge.git 2.0-alt1: build start
2026-Mar-23 09:36:08 :: [aarch64] #100 python3-module-deepmerge.git 2.0-alt1: build start
2026-Mar-23 09:36:19 :: [i586] #100 python3-module-deepmerge.git 2.0-alt1: build OK (cached)
2026-Mar-23 09:36:20 :: [i586] #300 zensical.git 0.0.28-alt1: build start
2026-Mar-23 09:36:20 :: [x86_64] #100 python3-module-deepmerge.git 2.0-alt1: build OK (cached)
2026-Mar-23 09:36:20 :: [x86_64] #300 zensical.git 0.0.28-alt1: build start
2026-Mar-23 09:36:38 :: [aarch64] #100 python3-module-deepmerge.git 2.0-alt1: build OK (cached)
2026-Mar-23 09:36:38 :: [aarch64] #300 zensical.git 0.0.28-alt1: build start
[x86_64] /.out/python3-module-zensical-0.0.28-alt1.noarch.rpm: FHS violations: /usr/lib64/python3/site-packages/zensical /usr/lib64/python3/site-packages/zensical-0.0.28.dist-info /usr/lib64/python3/site-packages/zensical-0.0.28.dist-info/METADATA /usr/lib64/python3/site-packages/zensical-0.0.28.dist-info/entry_points.txt /usr/lib64/python3/site-packages/zensical/__init__.py /usr/lib64/python3/site-packages/zensical/__main__.py /usr/lib64/python3/site-packages/zensical/__pycache__ /usr/lib64/python3/site-packages/zensical/__pycache__/__init__.cpython-313.opt-1.pyc /usr/lib64/python3/site-packages/zensical/__pycache__/__init__.cpython-313.opt-2.pyc /usr/lib64/python3/site-packages/zensical/__pycache__/__init__.cpython-313.pyc /usr/lib64/python3/site-packages/zensical/__pycache__/__main__.cpython-313.opt-1.pyc /usr/lib64/python3/site-packages/zensical/__pycache__/__main__.cpython-313.opt-2.pyc /usr/lib64/python3/site-packages/zensical/__pycache__/__main__.cpython-313.pyc /usr/lib64/python3/site-packages/zensical/__pycache__/config.cpython-313.opt-1.pyc /usr/lib64/python3/site-packages/zensical/__pycache__/config.cpython-313.opt-2.pyc /usr/lib64/python3/site-packages/zensical/__pycache__/config.cpython-313.pyc /usr/lib64/python3/site-packages/zensical/__pycache__/main.cpython-313.opt-1.pyc /usr/lib64/python3/site-packages/zensical/__pycache__/main.cpython-313.opt-2.pyc /usr/lib64/python3/site-packages/zensical/__pycache__/main.cpython-313.pyc /usr/lib64/python3/site-packages/zensical/__pycache__/markdown.cpython-313.opt-1.pyc /usr/lib64/python3/site-packages/zensical/__pycache__/markdown.cpython-313.opt-2.pyc /usr/lib64/python3/site-packages/zensical/__pycache__/markdown.cpython-313.pyc /usr/lib64/python3/site-packages/zensical/bootstrap /usr/lib64/python3/site-packages/zensical/bootstrap/.github /usr/lib64/python3/site-packages/zensical/bootstrap/.github/workflows /usr/lib64/python3/site-packages/zensical/bootstrap/.github/workflows/docs.yml /usr/lib64/python3/site-packages/zensical/bootstrap/docs /usr/lib64/python3/site-packages/zensical/bootstrap/docs/index.md /usr/lib64/python3/site-packages/zensical/bootstrap/docs/markdown.md /usr/lib64/python3/site-packages/zensical/bootstrap/zensical.toml /usr/lib64/python3/site-packages/zensical/compat /usr/lib64/python3/site-packages/zensical/compat/__init__.py /usr/lib64/python3/site-packages/zensical/compat/__pycache__ /usr/lib64/python3/site-packages/zensical/compat/__pycache__/__init__.cpython-313.opt-1.pyc /usr/lib64/python3/site-packages/zensical/compat/__pycache__/__init__.cpython-313.opt-2.pyc /usr/lib64/python3/site-packages/zensical/compat/__pycache__/__init__.cpython-313.pyc /usr/lib64/python3/site-packages/zensical/compat/__pycache__/autorefs.cpython-313.opt-1.pyc /usr/lib64/python3/site-packages/zensical/compat/__pycache__/autorefs.cpython-313.opt-2.pyc /usr/lib64/python3/site-packages/zensical/compat/__pycache__/autorefs.cpython-313.pyc /usr/lib64/python3/site-packages/zensical/compat/__pycache__/mkdocstrings.cpython-313.opt-1.pyc /usr/lib64/python3/site-packages/zensical/compat/__pycache__/mkdocstrings.cpython-313.opt-2.pyc /usr/lib64/python3/site-packages/zensical/compat/__pycache__/mkdocstrings.cpython-313.pyc /usr/lib64/python3/site-packages/zensical/compat/autorefs.py /usr/lib64/python3/site-packages/zensical/compat/mkdocstrings.py /usr/lib64/python3/site-packages/zensical/config.py /usr/lib64/python3/site-packages/zensical/extensions /usr/lib64/python3/site-packages/zensical/extensions/__init__.py /usr/lib64/python3/site-packages/zensical/extensions/__pycache__ /usr/lib64/python3/site-packages/zensical/extensions/__pycache__/__init__.cpython-313.opt-1.pyc /usr/lib64/python3/site-packages/zensical/extensions/__pycache__/__init__.cpython-313.opt-2.pyc /usr/lib64/python3/site-packages/zensical/extensions/__pycache__/__init__.cpython-313.pyc /usr/lib64/python3/site-packages/zensical/extensions/__pycache__/emoji.cpython-313.opt-1.pyc /usr/lib64/python3/site-packages/zensical/extensions/__pycache__/emoji.cpython-313.opt-2.pyc /usr/lib64/python3/site-packages/zensical/extensions/__pycache__/emoji.cpython-313.pyc /usr/lib64/python3/site-packages/zensical/extensions/__pycache__/links.cpython-313.opt-1.pyc /usr/lib64/python3/site-packages/zensical/extensions/__pycache__/links.cpython-313.opt-2.pyc /usr/lib64/python3/site-packages/zensical/extensions/__pycache__/links.cpython-313.pyc /usr/lib64/python3/site-packages/zensical/extensions/__pycache__/preview.cpython-313.opt-1.pyc /usr/lib64/python3/site-packages/zensical/extensions/__pycache__/preview.cpython-313.opt-2.pyc /usr/lib64/python3/site-packages/zensical/extensions/__pycache__/preview.cpython-313.pyc /usr/lib64/python3/site-packages/zensical/extensions/__pycache__/search.cpython-313.opt-1.pyc /usr/lib64/python3/site-packages/zensical/extensions/__pycache__/search.cpython-313.opt-2.pyc /usr/lib64/python3/site-packages/zensical/extensions/__pycache__/search.cpython-313.pyc /usr/lib64/python3/site-packages/zensical/extensions/emoji.py /usr/lib64/python3/site-packages/zensical/extensions/links.py /usr/lib64/python3/site-packages/zensical/extensions/preview.py /usr/lib64/python3/site-packages/zensical/extensions/search.py /usr/lib64/python3/site-packages/zensical/extensions/utilities /usr/lib64/python3/site-packages/zensical/extensions/utilities/__init__.py /usr/lib64/python3/site-packages/zensical/extensions/utilities/__pycache__ /usr/lib64/python3/site-packages/zensical/extensions/utilities/__pycache__/__init__.cpython-313.opt-1.pyc /usr/lib64/python3/site-packages/zensical/extensions/utilities/__pycache__/__init__.cpython-313.opt-2.pyc /usr/lib64/python3/site-packages/zensical/extensions/utilities/__pycache__/__init__.cpython-313.pyc /usr/lib64/python3/site-packages/zensical/extensions/utilities/__pycache__/filter.cpython-313.opt-1.pyc /usr/lib64/python3/site-packages/zensical/extensions/utilities/__pycache__/filter.cpython-313.opt-2.pyc /usr/lib64/python3/site-packages/zensical/extensions/utilities/__pycache__/filter.cpython-313.pyc /usr/lib64/python3/site-packages/zensical/extensions/utilities/filter.py /usr/lib64/python3/site-packages/zensical/main.py /usr/lib64/python3/site-packages/zensical/markdown.py /usr/lib64/python3/site-packages/zensical/zensical.abi3.so /usr/lib64/python3/site-packages/zensical/zensical.pyi
[x86_64] sisyphus_check: check-fhs ERROR: FHS violation
[x86_64] /.out/python3-module-zensical-0.0.28-alt1.noarch.rpm: invalid noarch dependencies: /usr/lib64/python3/site-packages ld-linux-x86-64.so.2()(64bit) ld-linux-x86-64.so.2(GLIBC_2.3)(64bit) libc.so.6(GLIBC_2.10)(64bit) libc.so.6(GLIBC_2.14)(64bit) libc.so.6(GLIBC_2.15)(64bit) libc.so.6(GLIBC_2.16)(64bit) libc.so.6(GLIBC_2.17)(64bit) libc.so.6(GLIBC_2.18)(64bit) libc.so.6(GLIBC_2.2.5)(64bit) libc.so.6(GLIBC_2.25)(64bit) libc.so.6(GLIBC_2.27)(64bit) libc.so.6(GLIBC_2.28)(64bit) libc.so.6(GLIBC_2.29)(64bit) libc.so.6(GLIBC_2.3)(64bit) libc.so.6(GLIBC_2.3.2)(64bit) libc.so.6(GLIBC_2.3.4)(64bit) libc.so.6(GLIBC_2.30)(64bit) libc.so.6(GLIBC_2.32)(64bit) libc.so.6(GLIBC_2.33)(64bit) libc.so.6(GLIBC_2.34)(64bit) libc.so.6(GLIBC_2.39)(64bit) libc.so.6(GLIBC_2.4)(64bit) libc.so.6(GLIBC_2.5)(64bit) libc.so.6(GLIBC_2.7)(64bit) libc.so.6(GLIBC_2.9)(64bit) libgcc_s.so.1(GCC_3.0)(64bit) libgcc_s.so.1(GCC_3.3)(64bit) libgcc_s.so.1(GCC_4.2.0)(64bit) libm.so.6(GLIBC_2.29)(64bit)
[x86_64] /.out/python3-module-zensical-0.0.28-alt1.noarch.rpm: invalid noarch file paths: /usr/lib64/python3/site-packages/zensical /usr/lib64/python3/site-packages/zensical-0.0.28.dist-info /usr/lib64/python3/site-packages/zensical-0.0.28.dist-info/METADATA /usr/lib64/python3/site-packages/zensical-0.0.28.dist-info/entry_points.txt /usr/lib64/python3/site-packages/zensical/__init__.py /usr/lib64/python3/site-packages/zensical/__main__.py /usr/lib64/python3/site-packages/zensical/__pycache__ /usr/lib64/python3/site-packages/zensical/__pycache__/__init__.cpython-313.opt-1.pyc /usr/lib64/python3/site-packages/zensical/__pycache__/__init__.cpython-313.opt-2.pyc /usr/lib64/python3/site-packages/zensical/__pycache__/__init__.cpython-313.pyc /usr/lib64/python3/site-packages/zensical/__pycache__/__main__.cpython-313.opt-1.pyc /usr/lib64/python3/site-packages/zensical/__pycache__/__main__.cpython-313.opt-2.pyc /usr/lib64/python3/site-packages/zensical/__pycache__/__main__.cpython-313.pyc /usr/lib64/python3/site-packages/zensical/__pycache__/config.cpython-313.opt-1.pyc /usr/lib64/python3/site-packages/zensical/__pycache__/config.cpython-313.opt-2.pyc /usr/lib64/python3/site-packages/zensical/__pycache__/config.cpython-313.pyc /usr/lib64/python3/site-packages/zensical/__pycache__/main.cpython-313.opt-1.pyc /usr/lib64/python3/site-packages/zensical/__pycache__/main.cpython-313.opt-2.pyc /usr/lib64/python3/site-packages/zensical/__pycache__/main.cpython-313.pyc /usr/lib64/python3/site-packages/zensical/__pycache__/markdown.cpython-313.opt-1.pyc /usr/lib64/python3/site-packages/zensical/__pycache__/markdown.cpython-313.opt-2.pyc /usr/lib64/python3/site-packages/zensical/__pycache__/markdown.cpython-313.pyc /usr/lib64/python3/site-packages/zensical/bootstrap /usr/lib64/python3/site-packages/zensical/bootstrap/.github /usr/lib64/python3/site-packages/zensical/bootstrap/.github/workflows /usr/lib64/python3/site-packages/zensical/bootstrap/.github/workflows/docs.yml /usr/lib64/python3/site-packages/zensical/bootstrap/docs /usr/lib64/python3/site-packages/zensical/bootstrap/docs/index.md /usr/lib64/python3/site-packages/zensical/bootstrap/docs/markdown.md /usr/lib64/python3/site-packages/zensical/bootstrap/zensical.toml /usr/lib64/python3/site-packages/zensical/compat /usr/lib64/python3/site-packages/zensical/compat/__init__.py /usr/lib64/python3/site-packages/zensical/compat/__pycache__ /usr/lib64/python3/site-packages/zensical/compat/__pycache__/__init__.cpython-313.opt-1.pyc /usr/lib64/python3/site-packages/zensical/compat/__pycache__/__init__.cpython-313.opt-2.pyc /usr/lib64/python3/site-packages/zensical/compat/__pycache__/__init__.cpython-313.pyc /usr/lib64/python3/site-packages/zensical/compat/__pycache__/autorefs.cpython-313.opt-1.pyc /usr/lib64/python3/site-packages/zensical/compat/__pycache__/autorefs.cpython-313.opt-2.pyc /usr/lib64/python3/site-packages/zensical/compat/__pycache__/autorefs.cpython-313.pyc /usr/lib64/python3/site-packages/zensical/compat/__pycache__/mkdocstrings.cpython-313.opt-1.pyc /usr/lib64/python3/site-packages/zensical/compat/__pycache__/mkdocstrings.cpython-313.opt-2.pyc /usr/lib64/python3/site-packages/zensical/compat/__pycache__/mkdocstrings.cpython-313.pyc /usr/lib64/python3/site-packages/zensical/compat/autorefs.py /usr/lib64/python3/site-packages/zensical/compat/mkdocstrings.py /usr/lib64/python3/site-packages/zensical/config.py /usr/lib64/python3/site-packages/zensical/extensions /usr/lib64/python3/site-packages/zensical/extensions/__init__.py /usr/lib64/python3/site-packages/zensical/extensions/__pycache__ /usr/lib64/python3/site-packages/zensical/extensions/__pycache__/__init__.cpython-313.opt-1.pyc /usr/lib64/python3/site-packages/zensical/extensions/__pycache__/__init__.cpython-313.opt-2.pyc /usr/lib64/python3/site-packages/zensical/extensions/__pycache__/__init__.cpython-313.pyc /usr/lib64/python3/site-packages/zensical/extensions/__pycache__/emoji.cpython-313.opt-1.pyc /usr/lib64/python3/site-packages/zensical/extensions/__pycache__/emoji.cpython-313.opt-2.pyc /usr/lib64/python3/site-packages/zensical/extensions/__pycache__/emoji.cpython-313.pyc /usr/lib64/python3/site-packages/zensical/extensions/__pycache__/links.cpython-313.opt-1.pyc /usr/lib64/python3/site-packages/zensical/extensions/__pycache__/links.cpython-313.opt-2.pyc /usr/lib64/python3/site-packages/zensical/extensions/__pycache__/links.cpython-313.pyc /usr/lib64/python3/site-packages/zensical/extensions/__pycache__/preview.cpython-313.opt-1.pyc /usr/lib64/python3/site-packages/zensical/extensions/__pycache__/preview.cpython-313.opt-2.pyc /usr/lib64/python3/site-packages/zensical/extensions/__pycache__/preview.cpython-313.pyc /usr/lib64/python3/site-packages/zensical/extensions/__pycache__/search.cpython-313.opt-1.pyc /usr/lib64/python3/site-packages/zensical/extensions/__pycache__/search.cpython-313.opt-2.pyc /usr/lib64/python3/site-packages/zensical/extensions/__pycache__/search.cpython-313.pyc /usr/lib64/python3/site-packages/zensical/extensions/emoji.py /usr/lib64/python3/site-packages/zensical/extensions/links.py /usr/lib64/python3/site-packages/zensical/extensions/preview.py /usr/lib64/python3/site-packages/zensical/extensions/search.py /usr/lib64/python3/site-packages/zensical/extensions/utilities /usr/lib64/python3/site-packages/zensical/extensions/utilities/__init__.py /usr/lib64/python3/site-packages/zensical/extensions/utilities/__pycache__ /usr/lib64/python3/site-packages/zensical/extensions/utilities/__pycache__/__init__.cpython-313.opt-1.pyc /usr/lib64/python3/site-packages/zensical/extensions/utilities/__pycache__/__init__.cpython-313.opt-2.pyc /usr/lib64/python3/site-packages/zensical/extensions/utilities/__pycache__/__init__.cpython-313.pyc /usr/lib64/python3/site-packages/zensical/extensions/utilities/__pycache__/filter.cpython-313.opt-1.pyc /usr/lib64/python3/site-packages/zensical/extensions/utilities/__pycache__/filter.cpython-313.opt-2.pyc /usr/lib64/python3/site-packages/zensical/extensions/utilities/__pycache__/filter.cpython-313.pyc /usr/lib64/python3/site-packages/zensical/extensions/utilities/filter.py /usr/lib64/python3/site-packages/zensical/main.py /usr/lib64/python3/site-packages/zensical/markdown.py /usr/lib64/python3/site-packages/zensical/zensical.abi3.so /usr/lib64/python3/site-packages/zensical/zensical.pyi
[x86_64] sisyphus_check: check-noarch ERROR: noarch packaging violation
[x86_64] /.out/python3-module-zensical-0.0.28-alt1.noarch.rpm: invalid noarch python module path: /usr/lib64/python3/site-packages/zensical /usr/lib64/python3/site-packages/zensical-0.0.28.dist-info
[x86_64] sisyphus_check: check-python ERROR: python modules packaging violation
[x86_64] hsh-rebuild: zensical-0.0.28-alt1.src.rpm: sisyphus_check failed.
2026-Mar-23 09:37:20 :: [x86_64] zensical.git 0.0.28-alt1: remote: build failed
2026-Mar-23 09:37:20 :: [x86_64] #300 zensical.git 0.0.28-alt1: build FAILED
2026-Mar-23 09:37:20 :: [x86_64] requesting cancellation of task processing
[i586] /.out/python3-module-zensical-0.0.28-alt1.noarch.rpm: invalid noarch dependencies: ld-linux.so.2(GLIBC_2.3) libc.so.6(GLIBC_2.0) libc.so.6(GLIBC_2.1) libc.so.6(GLIBC_2.1.2) libc.so.6(GLIBC_2.1.3) libc.so.6(GLIBC_2.10) libc.so.6(GLIBC_2.15) libc.so.6(GLIBC_2.16) libc.so.6(GLIBC_2.17) libc.so.6(GLIBC_2.18) libc.so.6(GLIBC_2.2) libc.so.6(GLIBC_2.2.4) libc.so.6(GLIBC_2.25) libc.so.6(GLIBC_2.27) libc.so.6(GLIBC_2.28) libc.so.6(GLIBC_2.29) libc.so.6(GLIBC_2.3) libc.so.6(GLIBC_2.3.2) libc.so.6(GLIBC_2.3.4) libc.so.6(GLIBC_2.30) libc.so.6(GLIBC_2.32) libc.so.6(GLIBC_2.33) libc.so.6(GLIBC_2.34) libc.so.6(GLIBC_2.39) libc.so.6(GLIBC_2.4) libc.so.6(GLIBC_2.5) libc.so.6(GLIBC_2.7) libc.so.6(GLIBC_2.9) libgcc_s.so.1(GCC_3.0) libgcc_s.so.1(GCC_3.3) libgcc_s.so.1(GCC_4.2.0) libm.so.6(GLIBC_2.29)
[i586] sisyphus_check: check-noarch ERROR: noarch packaging violation
[i586] hsh-rebuild: zensical-0.0.28-alt1.src.rpm: sisyphus_check failed.
2026-Mar-23 09:37:25 :: [i586] zensical.git 0.0.28-alt1: remote: build failed
2026-Mar-23 09:37:25 :: [i586] #300 zensical.git 0.0.28-alt1: build FAILED
[aarch64] /.out/python3-module-zensical-0.0.28-alt1.noarch.rpm: FHS violations: /usr/lib64/python3/site-packages/zensical /usr/lib64/python3/site-packages/zensical-0.0.28.dist-info /usr/lib64/python3/site-packages/zensical-0.0.28.dist-info/METADATA /usr/lib64/python3/site-packages/zensical-0.0.28.dist-info/entry_points.txt /usr/lib64/python3/site-packages/zensical/__init__.py /usr/lib64/python3/site-packages/zensical/__main__.py /usr/lib64/python3/site-packages/zensical/__pycache__ /usr/lib64/python3/site-packages/zensical/__pycache__/__init__.cpython-313.opt-1.pyc /usr/lib64/python3/site-packages/zensical/__pycache__/__init__.cpython-313.opt-2.pyc /usr/lib64/python3/site-packages/zensical/__pycache__/__init__.cpython-313.pyc /usr/lib64/python3/site-packages/zensical/__pycache__/__main__.cpython-313.opt-1.pyc /usr/lib64/python3/site-packages/zensical/__pycache__/__main__.cpython-313.opt-2.pyc /usr/lib64/python3/site-packages/zensical/__pycache__/__main__.cpython-313.pyc /usr/lib64/python3/site-packages/zensical/__pycache__/config.cpython-313.opt-1.pyc /usr/lib64/python3/site-packages/zensical/__pycache__/config.cpython-313.opt-2.pyc /usr/lib64/python3/site-packages/zensical/__pycache__/config.cpython-313.pyc /usr/lib64/python3/site-packages/zensical/__pycache__/main.cpython-313.opt-1.pyc /usr/lib64/python3/site-packages/zensical/__pycache__/main.cpython-313.opt-2.pyc /usr/lib64/python3/site-packages/zensical/__pycache__/main.cpython-313.pyc /usr/lib64/python3/site-packages/zensical/__pycache__/markdown.cpython-313.opt-1.pyc /usr/lib64/python3/site-packages/zensical/__pycache__/markdown.cpython-313.opt-2.pyc /usr/lib64/python3/site-packages/zensical/__pycache__/markdown.cpython-313.pyc /usr/lib64/python3/site-packages/zensical/bootstrap /usr/lib64/python3/site-packages/zensical/bootstrap/.github /usr/lib64/python3/site-packages/zensical/bootstrap/.github/workflows /usr/lib64/python3/site-packages/zensical/bootstrap/.github/workflows/docs.yml /usr/lib64/python3/site-packages/zensical/bootstrap/docs /usr/lib64/python3/site-packages/zensical/bootstrap/docs/index.md /usr/lib64/python3/site-packages/zensical/bootstrap/docs/markdown.md /usr/lib64/python3/site-packages/zensical/bootstrap/zensical.toml /usr/lib64/python3/site-packages/zensical/compat /usr/lib64/python3/site-packages/zensical/compat/__init__.py /usr/lib64/python3/site-packages/zensical/compat/__pycache__ /usr/lib64/python3/site-packages/zensical/compat/__pycache__/__init__.cpython-313.opt-1.pyc /usr/lib64/python3/site-packages/zensical/compat/__pycache__/__init__.cpython-313.opt-2.pyc /usr/lib64/python3/site-packages/zensical/compat/__pycache__/__init__.cpython-313.pyc /usr/lib64/python3/site-packages/zensical/compat/__pycache__/autorefs.cpython-313.opt-1.pyc /usr/lib64/python3/site-packages/zensical/compat/__pycache__/autorefs.cpython-313.opt-2.pyc /usr/lib64/python3/site-packages/zensical/compat/__pycache__/autorefs.cpython-313.pyc /usr/lib64/python3/site-packages/zensical/compat/__pycache__/mkdocstrings.cpython-313.opt-1.pyc /usr/lib64/python3/site-packages/zensical/compat/__pycache__/mkdocstrings.cpython-313.opt-2.pyc /usr/lib64/python3/site-packages/zensical/compat/__pycache__/mkdocstrings.cpython-313.pyc /usr/lib64/python3/site-packages/zensical/compat/autorefs.py /usr/lib64/python3/site-packages/zensical/compat/mkdocstrings.py /usr/lib64/python3/site-packages/zensical/config.py /usr/lib64/python3/site-packages/zensical/extensions /usr/lib64/python3/site-packages/zensical/extensions/__init__.py /usr/lib64/python3/site-packages/zensical/extensions/__pycache__ /usr/lib64/python3/site-packages/zensical/extensions/__pycache__/__init__.cpython-313.opt-1.pyc /usr/lib64/python3/site-packages/zensical/extensions/__pycache__/__init__.cpython-313.opt-2.pyc /usr/lib64/python3/site-packages/zensical/extensions/__pycache__/__init__.cpython-313.pyc /usr/lib64/python3/site-packages/zensical/extensions/__pycache__/emoji.cpython-313.opt-1.pyc /usr/lib64/python3/site-packages/zensical/extensions/__pycache__/emoji.cpython-313.opt-2.pyc /usr/lib64/python3/site-packages/zensical/extensions/__pycache__/emoji.cpython-313.pyc /usr/lib64/python3/site-packages/zensical/extensions/__pycache__/links.cpython-313.opt-1.pyc /usr/lib64/python3/site-packages/zensical/extensions/__pycache__/links.cpython-313.opt-2.pyc /usr/lib64/python3/site-packages/zensical/extensions/__pycache__/links.cpython-313.pyc /usr/lib64/python3/site-packages/zensical/extensions/__pycache__/preview.cpython-313.opt-1.pyc /usr/lib64/python3/site-packages/zensical/extensions/__pycache__/preview.cpython-313.opt-2.pyc /usr/lib64/python3/site-packages/zensical/extensions/__pycache__/preview.cpython-313.pyc /usr/lib64/python3/site-packages/zensical/extensions/__pycache__/search.cpython-313.opt-1.pyc /usr/lib64/python3/site-packages/zensical/extensions/__pycache__/search.cpython-313.opt-2.pyc /usr/lib64/python3/site-packages/zensical/extensions/__pycache__/search.cpython-313.pyc /usr/lib64/python3/site-packages/zensical/extensions/emoji.py /usr/lib64/python3/site-packages/zensical/extensions/links.py /usr/lib64/python3/site-packages/zensical/extensions/preview.py /usr/lib64/python3/site-packages/zensical/extensions/search.py /usr/lib64/python3/site-packages/zensical/extensions/utilities /usr/lib64/python3/site-packages/zensical/extensions/utilities/__init__.py /usr/lib64/python3/site-packages/zensical/extensions/utilities/__pycache__ /usr/lib64/python3/site-packages/zensical/extensions/utilities/__pycache__/__init__.cpython-313.opt-1.pyc /usr/lib64/python3/site-packages/zensical/extensions/utilities/__pycache__/__init__.cpython-313.opt-2.pyc /usr/lib64/python3/site-packages/zensical/extensions/utilities/__pycache__/__init__.cpython-313.pyc /usr/lib64/python3/site-packages/zensical/extensions/utilities/__pycache__/filter.cpython-313.opt-1.pyc /usr/lib64/python3/site-packages/zensical/extensions/utilities/__pycache__/filter.cpython-313.opt-2.pyc /usr/lib64/python3/site-packages/zensical/extensions/utilities/__pycache__/filter.cpython-313.pyc /usr/lib64/python3/site-packages/zensical/extensions/utilities/filter.py /usr/lib64/python3/site-packages/zensical/main.py /usr/lib64/python3/site-packages/zensical/markdown.py /usr/lib64/python3/site-packages/zensical/zensical.abi3.so /usr/lib64/python3/site-packages/zensical/zensical.pyi
[aarch64] sisyphus_check: check-fhs ERROR: FHS violation
[aarch64] /.out/python3-module-zensical-0.0.28-alt1.noarch.rpm: invalid noarch dependencies: /usr/lib64/python3/site-packages libc.so.6(GLIBC_2.17)(64bit) libc.so.6(GLIBC_2.18)(64bit) libc.so.6(GLIBC_2.25)(64bit) libc.so.6(GLIBC_2.27)(64bit) libc.so.6(GLIBC_2.28)(64bit) libc.so.6(GLIBC_2.29)(64bit) libc.so.6(GLIBC_2.30)(64bit) libc.so.6(GLIBC_2.32)(64bit) libc.so.6(GLIBC_2.33)(64bit) libc.so.6(GLIBC_2.34)(64bit) libc.so.6(GLIBC_2.39)(64bit) libgcc_s.so.1(GCC_3.0)(64bit) libgcc_s.so.1(GCC_3.3)(64bit) libgcc_s.so.1(GCC_4.2.0)(64bit) libm.so.6(GLIBC_2.29)(64bit)
[aarch64] /.out/python3-module-zensical-0.0.28-alt1.noarch.rpm: invalid noarch file paths: /usr/lib64/python3/site-packages/zensical /usr/lib64/python3/site-packages/zensical-0.0.28.dist-info /usr/lib64/python3/site-packages/zensical-0.0.28.dist-info/METADATA /usr/lib64/python3/site-packages/zensical-0.0.28.dist-info/entry_points.txt /usr/lib64/python3/site-packages/zensical/__init__.py /usr/lib64/python3/site-packages/zensical/__main__.py /usr/lib64/python3/site-packages/zensical/__pycache__ /usr/lib64/python3/site-packages/zensical/__pycache__/__init__.cpython-313.opt-1.pyc /usr/lib64/python3/site-packages/zensical/__pycache__/__init__.cpython-313.opt-2.pyc /usr/lib64/python3/site-packages/zensical/__pycache__/__init__.cpython-313.pyc /usr/lib64/python3/site-packages/zensical/__pycache__/__main__.cpython-313.opt-1.pyc /usr/lib64/python3/site-packages/zensical/__pycache__/__main__.cpython-313.opt-2.pyc /usr/lib64/python3/site-packages/zensical/__pycache__/__main__.cpython-313.pyc /usr/lib64/python3/site-packages/zensical/__pycache__/config.cpython-313.opt-1.pyc /usr/lib64/python3/site-packages/zensical/__pycache__/config.cpython-313.opt-2.pyc /usr/lib64/python3/site-packages/zensical/__pycache__/config.cpython-313.pyc /usr/lib64/python3/site-packages/zensical/__pycache__/main.cpython-313.opt-1.pyc /usr/lib64/python3/site-packages/zensical/__pycache__/main.cpython-313.opt-2.pyc /usr/lib64/python3/site-packages/zensical/__pycache__/main.cpython-313.pyc /usr/lib64/python3/site-packages/zensical/__pycache__/markdown.cpython-313.opt-1.pyc /usr/lib64/python3/site-packages/zensical/__pycache__/markdown.cpython-313.opt-2.pyc /usr/lib64/python3/site-packages/zensical/__pycache__/markdown.cpython-313.pyc /usr/lib64/python3/site-packages/zensical/bootstrap /usr/lib64/python3/site-packages/zensical/bootstrap/.github /usr/lib64/python3/site-packages/zensical/bootstrap/.github/workflows /usr/lib64/python3/site-packages/zensical/bootstrap/.github/workflows/docs.yml /usr/lib64/python3/site-packages/zensical/bootstrap/docs /usr/lib64/python3/site-packages/zensical/bootstrap/docs/index.md /usr/lib64/python3/site-packages/zensical/bootstrap/docs/markdown.md /usr/lib64/python3/site-packages/zensical/bootstrap/zensical.toml /usr/lib64/python3/site-packages/zensical/compat /usr/lib64/python3/site-packages/zensical/compat/__init__.py /usr/lib64/python3/site-packages/zensical/compat/__pycache__ /usr/lib64/python3/site-packages/zensical/compat/__pycache__/__init__.cpython-313.opt-1.pyc /usr/lib64/python3/site-packages/zensical/compat/__pycache__/__init__.cpython-313.opt-2.pyc /usr/lib64/python3/site-packages/zensical/compat/__pycache__/__init__.cpython-313.pyc /usr/lib64/python3/site-packages/zensical/compat/__pycache__/autorefs.cpython-313.opt-1.pyc /usr/lib64/python3/site-packages/zensical/compat/__pycache__/autorefs.cpython-313.opt-2.pyc /usr/lib64/python3/site-packages/zensical/compat/__pycache__/autorefs.cpython-313.pyc /usr/lib64/python3/site-packages/zensical/compat/__pycache__/mkdocstrings.cpython-313.opt-1.pyc /usr/lib64/python3/site-packages/zensical/compat/__pycache__/mkdocstrings.cpython-313.opt-2.pyc /usr/lib64/python3/site-packages/zensical/compat/__pycache__/mkdocstrings.cpython-313.pyc /usr/lib64/python3/site-packages/zensical/compat/autorefs.py /usr/lib64/python3/site-packages/zensical/compat/mkdocstrings.py /usr/lib64/python3/site-packages/zensical/config.py /usr/lib64/python3/site-packages/zensical/extensions /usr/lib64/python3/site-packages/zensical/extensions/__init__.py /usr/lib64/python3/site-packages/zensical/extensions/__pycache__ /usr/lib64/python3/site-packages/zensical/extensions/__pycache__/__init__.cpython-313.opt-1.pyc /usr/lib64/python3/site-packages/zensical/extensions/__pycache__/__init__.cpython-313.opt-2.pyc /usr/lib64/python3/site-packages/zensical/extensions/__pycache__/__init__.cpython-313.pyc /usr/lib64/python3/site-packages/zensical/extensions/__pycache__/emoji.cpython-313.opt-1.pyc /usr/lib64/python3/site-packages/zensical/extensions/__pycache__/emoji.cpython-313.opt-2.pyc /usr/lib64/python3/site-packages/zensical/extensions/__pycache__/emoji.cpython-313.pyc /usr/lib64/python3/site-packages/zensical/extensions/__pycache__/links.cpython-313.opt-1.pyc /usr/lib64/python3/site-packages/zensical/extensions/__pycache__/links.cpython-313.opt-2.pyc /usr/lib64/python3/site-packages/zensical/extensions/__pycache__/links.cpython-313.pyc /usr/lib64/python3/site-packages/zensical/extensions/__pycache__/preview.cpython-313.opt-1.pyc /usr/lib64/python3/site-packages/zensical/extensions/__pycache__/preview.cpython-313.opt-2.pyc /usr/lib64/python3/site-packages/zensical/extensions/__pycache__/preview.cpython-313.pyc /usr/lib64/python3/site-packages/zensical/extensions/__pycache__/search.cpython-313.opt-1.pyc /usr/lib64/python3/site-packages/zensical/extensions/__pycache__/search.cpython-313.opt-2.pyc /usr/lib64/python3/site-packages/zensical/extensions/__pycache__/search.cpython-313.pyc /usr/lib64/python3/site-packages/zensical/extensions/emoji.py /usr/lib64/python3/site-packages/zensical/extensions/links.py /usr/lib64/python3/site-packages/zensical/extensions/preview.py /usr/lib64/python3/site-packages/zensical/extensions/search.py /usr/lib64/python3/site-packages/zensical/extensions/utilities /usr/lib64/python3/site-packages/zensical/extensions/utilities/__init__.py /usr/lib64/python3/site-packages/zensical/extensions/utilities/__pycache__ /usr/lib64/python3/site-packages/zensical/extensions/utilities/__pycache__/__init__.cpython-313.opt-1.pyc /usr/lib64/python3/site-packages/zensical/extensions/utilities/__pycache__/__init__.cpython-313.opt-2.pyc /usr/lib64/python3/site-packages/zensical/extensions/utilities/__pycache__/__init__.cpython-313.pyc /usr/lib64/python3/site-packages/zensical/extensions/utilities/__pycache__/filter.cpython-313.opt-1.pyc /usr/lib64/python3/site-packages/zensical/extensions/utilities/__pycache__/filter.cpython-313.opt-2.pyc /usr/lib64/python3/site-packages/zensical/extensions/utilities/__pycache__/filter.cpython-313.pyc /usr/lib64/python3/site-packages/zensical/extensions/utilities/filter.py /usr/lib64/python3/site-packages/zensical/main.py /usr/lib64/python3/site-packages/zensical/markdown.py /usr/lib64/python3/site-packages/zensical/zensical.abi3.so /usr/lib64/python3/site-packages/zensical/zensical.pyi
[aarch64] sisyphus_check: check-noarch ERROR: noarch packaging violation
[aarch64] /.out/python3-module-zensical-0.0.28-alt1.noarch.rpm: invalid noarch python module path: /usr/lib64/python3/site-packages/zensical /usr/lib64/python3/site-packages/zensical-0.0.28.dist-info
[aarch64] sisyphus_check: check-python ERROR: python modules packaging violation
[aarch64] hsh-rebuild: zensical-0.0.28-alt1.src.rpm: sisyphus_check failed.
2026-Mar-23 09:38:33 :: [aarch64] zensical.git 0.0.28-alt1: remote: build failed
2026-Mar-23 09:38:33 :: [aarch64] #300 zensical.git 0.0.28-alt1: build FAILED
2026-Mar-23 09:37:20 :: [x86_64] build FAILED
2026-Mar-23 09:37:25 :: [i586] build FAILED
2026-Mar-23 09:38:33 :: [aarch64] build FAILED
2026-Mar-23 09:38:33 :: task #412311 for sisyphus FAILED


More information about the Sisyphus-incominger mailing list