[#412278] [test-only] FAILED (try 2) kicad.git=10.0.0-alt1
Girar awaiter (antohami)
girar-builder at altlinux.org
Sun Mar 22 22:08:16 MSK 2026
https://git.altlinux.org/tasks/412278/logs/events.2.1.log
https://packages.altlinux.org/tasks/412278
subtask name aarch64 i586 x86_64
#200 kicad failed failed failed
2026-Mar-22 18:51:11 :: test-only task #412278 for sisyphus resumed by antohami:
#100 removed
#200 build 10.0.0-alt1 from /people/antohami/packages/kicad.git fetched at 2026-Mar-22 18:49:27
2026-Mar-22 18:51:12 :: [aarch64] #200 kicad.git 10.0.0-alt1: build start
2026-Mar-22 18:51:12 :: [i586] #200 kicad.git 10.0.0-alt1: build start
2026-Mar-22 18:51:12 :: [x86_64] #200 kicad.git 10.0.0-alt1: build start
[x86_64] /usr/share/zsh/site-functions/_kicad-cli
[x86_64] error: File list check failed, terminating build
[x86_64] RPM build errors:
[x86_64] Installed (but unpackaged) file(s) found:
[x86_64] File list check failed, terminating build
2026-Mar-22 18:59:14 :: [x86_64] kicad.git 10.0.0-alt1: remote: build failed
2026-Mar-22 18:59:14 :: [x86_64] #200 kicad.git 10.0.0-alt1: build FAILED
2026-Mar-22 18:59:14 :: [x86_64] requesting cancellation of task processing
[i586] /usr/share/zsh/site-functions/_kicad-cli
[i586] error: File list check failed, terminating build
[i586] RPM build errors:
[i586] Installed (but unpackaged) file(s) found:
[i586] File list check failed, terminating build
2026-Mar-22 18:59:48 :: [i586] kicad.git 10.0.0-alt1: remote: build failed
2026-Mar-22 18:59:48 :: [i586] #200 kicad.git 10.0.0-alt1: build FAILED
[aarch64] /usr/share/zsh/site-functions/_kicad-cli
[aarch64] error: File list check failed, terminating build
[aarch64] RPM build errors:
[aarch64] Installed (but unpackaged) file(s) found:
[aarch64] File list check failed, terminating build
2026-Mar-22 19:08:15 :: [aarch64] kicad.git 10.0.0-alt1: remote: build failed
2026-Mar-22 19:08:15 :: [aarch64] #200 kicad.git 10.0.0-alt1: build FAILED
2026-Mar-22 18:59:14 :: [x86_64] build FAILED
2026-Mar-22 18:59:48 :: [i586] build FAILED
2026-Mar-22 19:08:15 :: [aarch64] build FAILED
2026-Mar-22 19:08:16 :: task #412278 for sisyphus FAILED
More information about the Sisyphus-incominger
mailing list