[#412228] [test-only] p11 FAILED (try 2) srpm=evolution-data-server-3.60.0-alt1.src.rpm ...

Girar awaiter (antohami) girar-builder at altlinux.org
Sat Mar 21 21:09:38 MSK 2026


https://git.altlinux.org/tasks/412228/logs/events.2.1.log
https://packages.altlinux.org/tasks/412228

subtask  name                   aarch64    i586  x86_64
    #40  evolution-data-server     5:26    3:45    3:36
   #100  evolution                    ?  failed  failed

2026-Mar-21 18:04:11 :: test-only task #412228 for p11 resumed by antohami:
2026-Mar-21 18:04:11 :: message: for_update_shared-mime-info
#40 build evolution-data-server-3.60.0-alt1.src.rpm from sisyphus
#100 build evolution-3.58.3-alt1.src.rpm
2026-Mar-21 18:04:11 :: created build repo
2026-Mar-21 18:04:12 :: [x86_64] #40 evolution-data-server-3.60.0-alt1.src.rpm: build start
2026-Mar-21 18:04:12 :: [i586] #40 evolution-data-server-3.60.0-alt1.src.rpm: build start
2026-Mar-21 18:04:12 :: [aarch64] #40 evolution-data-server-3.60.0-alt1.src.rpm: build start
2026-Mar-21 18:07:48 :: [x86_64] #40 evolution-data-server-3.60.0-alt1.src.rpm: build OK
2026-Mar-21 18:07:48 :: [x86_64] #100 evolution-3.58.3-alt1.src.rpm: build start
2026-Mar-21 18:07:57 :: [i586] #40 evolution-data-server-3.60.0-alt1.src.rpm: build OK
2026-Mar-21 18:07:57 :: [i586] #100 evolution-3.58.3-alt1.src.rpm: build start
[x86_64] --   Found libedataserver-1.2, version 3.60.0
[x86_64] Package libpcre2-8 was not found in the pkg-config search path.
[x86_64] Perhaps you should add the directory containing `libpcre2-8.pc'
[x86_64] to the PKG_CONFIG_PATH environment variable
[x86_64] Package 'libpcre2-8', required by 'glib-2.0', not found
[x86_64] Package libpcre2-8 was not found in the pkg-config search path.
[x86_64] Perhaps you should add the directory containing `libpcre2-8.pc'
[x86_64] to the PKG_CONFIG_PATH environment variable
[x86_64] Package 'libpcre2-8', required by 'glib-2.0', not found
[x86_64] Package libpcre2-8 was not found in the pkg-config search path.
[x86_64] Perhaps you should add the directory containing `libpcre2-8.pc'
[x86_64] to the PKG_CONFIG_PATH environment variable
[x86_64] Package 'libpcre2-8', required by 'glib-2.0', not found
[x86_64] Package libpcre2-8 was not found in the pkg-config search path.
[x86_64] Perhaps you should add the directory containing `libpcre2-8.pc'
[x86_64] to the PKG_CONFIG_PATH environment variable
[x86_64] Package 'libpcre2-8', required by 'glib-2.0', not found
[x86_64] -- Checking for module 'camel-1.2'
[x86_64] --   Found camel-1.2, version 3.60.0
[x86_64] Package libpcre2-8 was not found in the pkg-config search path.
[x86_64] Perhaps you should add the directory containing `libpcre2-8.pc'
[x86_64] to the PKG_CONFIG_PATH environment variable
[x86_64] Package 'libpcre2-8', required by 'glib-2.0', not found
[x86_64] Package libpcre2-8 was not found in the pkg-config search path.
2026-Mar-21 18:08:44 :: [x86_64] evolution-3.58.3-alt1.src.rpm: remote: build failed
2026-Mar-21 18:08:44 :: [x86_64] #100 evolution-3.58.3-alt1.src.rpm: build FAILED
2026-Mar-21 18:08:44 :: [x86_64] requesting cancellation of task processing
[i586] --   Found libedataserver-1.2, version 3.60.0
[i586] Package libpcre2-8 was not found in the pkg-config search path.
[i586] Perhaps you should add the directory containing `libpcre2-8.pc'
[i586] to the PKG_CONFIG_PATH environment variable
[i586] Package 'libpcre2-8', required by 'glib-2.0', not found
[i586] Package libpcre2-8 was not found in the pkg-config search path.
[i586] Perhaps you should add the directory containing `libpcre2-8.pc'
[i586] to the PKG_CONFIG_PATH environment variable
[i586] Package 'libpcre2-8', required by 'glib-2.0', not found
[i586] Package libpcre2-8 was not found in the pkg-config search path.
[i586] Perhaps you should add the directory containing `libpcre2-8.pc'
[i586] to the PKG_CONFIG_PATH environment variable
[i586] Package 'libpcre2-8', required by 'glib-2.0', not found
[i586] Package libpcre2-8 was not found in the pkg-config search path.
[i586] Perhaps you should add the directory containing `libpcre2-8.pc'
[i586] to the PKG_CONFIG_PATH environment variable
[i586] Package 'libpcre2-8', required by 'glib-2.0', not found
[i586] -- Checking for module 'camel-1.2'
[i586] --   Found camel-1.2, version 3.60.0
[i586] Package libpcre2-8 was not found in the pkg-config search path.
[i586] Perhaps you should add the directory containing `libpcre2-8.pc'
[i586] to the PKG_CONFIG_PATH environment variable
[i586] Package 'libpcre2-8', required by 'glib-2.0', not found
[i586] Package libpcre2-8 was not found in the pkg-config search path.
2026-Mar-21 18:08:58 :: [i586] evolution-3.58.3-alt1.src.rpm: remote: build failed
2026-Mar-21 18:08:58 :: [i586] #100 evolution-3.58.3-alt1.src.rpm: build FAILED
2026-Mar-21 18:09:38 :: [aarch64] #40 evolution-data-server-3.60.0-alt1.src.rpm: build OK
2026-Mar-21 18:09:38 :: [aarch64] task processing CANCELLED
2026-Mar-21 18:08:44 :: [x86_64] build FAILED
2026-Mar-21 18:08:58 :: [i586] build FAILED
2026-Mar-21 18:09:38 :: [aarch64] build FAILED
2026-Mar-21 18:09:38 :: task #412228 for p11 FAILED


More information about the Sisyphus-incominger mailing list