[#411506] [test-only] FAILED (try 3) branding-alt-spworkstation.git=11.0-alt0.13
Girar awaiter (antohami)
girar-builder at altlinux.org
Mon Mar 16 18:18:21 MSK 2026
https://git.altlinux.org/tasks/411506/logs/events.3.1.log
https://packages.altlinux.org/tasks/411506
subtask name aarch64 i586 x86_64
#300 branding-alt-spworkstation failed failed failed
2026-Mar-16 15:16:20 :: test-only task #411506 for sisyphus resumed by antohami:
#100 removed
#200 removed
#300 build 11.0-alt0.13 from /people/antohami/packages/branding-alt-spworkstation.git fetched at 2026-Mar-16 15:16:09
2026-Mar-16 15:16:21 :: [i586] #300 branding-alt-spworkstation.git 11.0-alt0.13: build start
2026-Mar-16 15:16:21 :: [x86_64] #300 branding-alt-spworkstation.git 11.0-alt0.13: build start
2026-Mar-16 15:16:21 :: [aarch64] #300 branding-alt-spworkstation.git 11.0-alt0.13: build start
[x86_64] /.out/branding-alt-spworkstation-bootsplash-11.0-alt0.13.noarch.rpm: unprintable package information: ÐлÑÑ
[x86_64] sisyphus_check: check-printable ERROR: package information violation
[x86_64] /.out/branding-alt-spworkstation-bootsplash-11.0-alt0.13.noarch.rpm: license not found in '/usr/share/license' directory: Distributable
[x86_64] --
[x86_64] /.out/branding-alt-spworkstation-gnome-settings-11.0-alt0.13.noarch.rpm: unprintable package information: ÐлÑÑ
[x86_64] sisyphus_check: check-printable ERROR: package information violation
[x86_64] /.out/branding-alt-spworkstation-gnome-settings-11.0-alt0.13.noarch.rpm: license not found in '/usr/share/license' directory: Distributable
[x86_64] --
[x86_64] /.out/branding-alt-spworkstation-indexhtml-11.0-alt0.13.noarch.rpm: license not found in '/usr/share/license' directory: distributable
[x86_64] hsh-rebuild: branding-alt-spworkstation-11.0-alt0.13.src.rpm: sisyphus_check failed.
2026-Mar-16 15:17:49 :: [x86_64] branding-alt-spworkstation.git 11.0-alt0.13: remote: build failed
2026-Mar-16 15:17:49 :: [x86_64] #300 branding-alt-spworkstation.git 11.0-alt0.13: build FAILED
2026-Mar-16 15:17:49 :: [x86_64] requesting cancellation of task processing
[i586] /.out/branding-alt-spworkstation-bootsplash-11.0-alt0.13.noarch.rpm: unprintable package information: ÐлÑÑ
[i586] sisyphus_check: check-printable ERROR: package information violation
[i586] /.out/branding-alt-spworkstation-bootsplash-11.0-alt0.13.noarch.rpm: license not found in '/usr/share/license' directory: Distributable
[i586] --
[i586] /.out/branding-alt-spworkstation-gnome-settings-11.0-alt0.13.noarch.rpm: unprintable package information: ÐлÑÑ
[i586] sisyphus_check: check-printable ERROR: package information violation
[i586] /.out/branding-alt-spworkstation-gnome-settings-11.0-alt0.13.noarch.rpm: license not found in '/usr/share/license' directory: Distributable
[i586] --
[i586] /.out/branding-alt-spworkstation-indexhtml-11.0-alt0.13.noarch.rpm: license not found in '/usr/share/license' directory: distributable
[i586] hsh-rebuild: branding-alt-spworkstation-11.0-alt0.13.src.rpm: sisyphus_check failed.
2026-Mar-16 15:17:51 :: [i586] branding-alt-spworkstation.git 11.0-alt0.13: remote: build failed
2026-Mar-16 15:17:51 :: [i586] #300 branding-alt-spworkstation.git 11.0-alt0.13: build FAILED
[aarch64] /.out/branding-alt-spworkstation-bootsplash-11.0-alt0.13.noarch.rpm: unprintable package information: ÐлÑÑ
[aarch64] sisyphus_check: check-printable ERROR: package information violation
[aarch64] /.out/branding-alt-spworkstation-bootsplash-11.0-alt0.13.noarch.rpm: license not found in '/usr/share/license' directory: Distributable
[aarch64] --
[aarch64] /.out/branding-alt-spworkstation-gnome-settings-11.0-alt0.13.noarch.rpm: unprintable package information: ÐлÑÑ
[aarch64] sisyphus_check: check-printable ERROR: package information violation
[aarch64] /.out/branding-alt-spworkstation-gnome-settings-11.0-alt0.13.noarch.rpm: license not found in '/usr/share/license' directory: Distributable
[aarch64] --
[aarch64] /.out/branding-alt-spworkstation-indexhtml-11.0-alt0.13.noarch.rpm: license not found in '/usr/share/license' directory: distributable
[aarch64] hsh-rebuild: branding-alt-spworkstation-11.0-alt0.13.src.rpm: sisyphus_check failed.
2026-Mar-16 15:18:20 :: [aarch64] branding-alt-spworkstation.git 11.0-alt0.13: remote: build failed
2026-Mar-16 15:18:20 :: [aarch64] #300 branding-alt-spworkstation.git 11.0-alt0.13: build FAILED
2026-Mar-16 15:17:49 :: [x86_64] build FAILED
2026-Mar-16 15:17:51 :: [i586] build FAILED
2026-Mar-16 15:18:21 :: [aarch64] build FAILED
2026-Mar-16 15:18:21 :: task #411506 for sisyphus FAILED
More information about the Sisyphus-incominger
mailing list