[#408845] [test-only] FAILED (try 10) libtdb.git=1.4.14-alt1 libtevent.git=0.17.1-alt1 samba.git=4.23.8-alt1 ...

Girar awaiter (sin) girar-builder at altlinux.org
Mon Jul 27 22:23:24 MSK 2026


https://git.altlinux.org/tasks/408845/logs/events.10.1.log
https://packages.altlinux.org/tasks/408845

subtask  name       aarch64    i586  x86_64
    #40  libtdb        2:14    1:10    1:07
   #140  libtevent     1:42      49      47
   #270  samba       failed  failed  failed

2026-Jul-27 19:07:09 :: test-only task #408845 for sisyphus resumed by sin:
2026-Jul-27 19:07:09 :: message: new_samba_major_release
#40 build 1.4.14-alt1 from /people/sin/packages/libtdb.git fetched at 2026-Feb-25 04:31:29
#100 removed
#140 build 0.17.1-alt1 from /people/sin/packages/libtevent.git fetched at 2026-Jul-09 16:38:38
#200 removed
#220 removed
#240 removed
#260 removed
#270 build 4.23.8-alt1 from /people/sin/packages/samba.git fetched at 2026-Jul-27 19:04:43
#300 removed
#400 build 2.12.0-alt1 from /gears/s/sssd.git fetched at 2026-Jul-09 14:53:18 from sisyphus
#500 build 4.13.1-alt7 from /gears/f/freeipa.git fetched at 2026-Jul-09 14:53:26 from sisyphus
#600 build 0.0.4-alt1 from /gears/l/libgkdi.git fetched at 2026-Jul-09 14:53:28 from sisyphus
#700 build 0.0.4-alt1 from /gears/l/libcng-dpapi.git fetched at 2026-Jul-09 14:53:29 from sisyphus
#1000 build 0.24.0-alt1 from /gears/a/admc.git fetched at 2026-Jul-09 14:53:31 from sisyphus
#1100 build 0.2.56-alt1 from /gears/g/gpui.git fetched at 2026-Jul-09 14:53:32 from sisyphus
2026-Jul-27 19:07:10 :: created build repo
2026-Jul-27 19:07:11 :: #1000: force rebuild
2026-Jul-27 19:07:11 :: #1100: force rebuild
2026-Jul-27 19:07:11 :: [aarch64] #40 libtdb.git 1.4.14-alt1: build start
2026-Jul-27 19:07:11 :: [i586] #40 libtdb.git 1.4.14-alt1: build start
2026-Jul-27 19:07:11 :: [x86_64] #40 libtdb.git 1.4.14-alt1: build start
2026-Jul-27 19:08:18 :: [x86_64] #40 libtdb.git 1.4.14-alt1: build OK
2026-Jul-27 19:08:18 :: [x86_64] #140 libtevent.git 0.17.1-alt1: build start
2026-Jul-27 19:08:21 :: [i586] #40 libtdb.git 1.4.14-alt1: build OK
2026-Jul-27 19:08:21 :: [i586] #140 libtevent.git 0.17.1-alt1: build start
2026-Jul-27 19:09:05 :: [x86_64] #140 libtevent.git 0.17.1-alt1: build OK
2026-Jul-27 19:09:05 :: [x86_64] #270 samba.git 4.23.8-alt1: build start
2026-Jul-27 19:09:10 :: [i586] #140 libtevent.git 0.17.1-alt1: build OK
2026-Jul-27 19:09:10 :: [i586] #270 samba.git 4.23.8-alt1: build start
2026-Jul-27 19:09:25 :: [aarch64] #40 libtdb.git 1.4.14-alt1: build OK
2026-Jul-27 19:09:25 :: [aarch64] #140 libtevent.git 0.17.1-alt1: build start
2026-Jul-27 19:11:07 :: [aarch64] #140 libtevent.git 0.17.1-alt1: build OK
2026-Jul-27 19:11:07 :: [aarch64] #270 samba.git 4.23.8-alt1: build start
[x86_64] + mv /usr/src/tmp/samba-buildroot/usr/bin/smb_prometheus_endpoint /usr/src/tmp/samba-buildroot/usr/lib64/samba/bin/
[x86_64] mv: cannot stat '/usr/src/tmp/samba-buildroot/usr/bin/smb_prometheus_endpoint': No such file or directory
[x86_64] error: Bad exit status from /usr/src/tmp/rpmb-tmp.FKJG3a (%install)
2026-Jul-27 19:15:22 :: [x86_64] samba.git 4.23.8-alt1: remote: build failed
2026-Jul-27 19:15:22 :: [x86_64] #270 samba.git 4.23.8-alt1: build FAILED
2026-Jul-27 19:15:22 :: [x86_64] requesting cancellation of task processing
[i586] + mv /usr/src/tmp/samba-buildroot/usr/bin/smb_prometheus_endpoint /usr/src/tmp/samba-buildroot/usr/lib/samba/bin/
[i586] mv: cannot stat '/usr/src/tmp/samba-buildroot/usr/bin/smb_prometheus_endpoint': No such file or directory
[i586] error: Bad exit status from /usr/src/tmp/rpmb-tmp.HzQ44r (%install)
2026-Jul-27 19:16:52 :: [i586] samba.git 4.23.8-alt1: remote: build failed
2026-Jul-27 19:16:52 :: [i586] #270 samba.git 4.23.8-alt1: build FAILED
[aarch64] + mv /usr/src/tmp/samba-buildroot/usr/bin/smb_prometheus_endpoint /usr/src/tmp/samba-buildroot/usr/lib64/samba/bin/
[aarch64] mv: cannot stat '/usr/src/tmp/samba-buildroot/usr/bin/smb_prometheus_endpoint': No such file or directory
[aarch64] error: Bad exit status from /usr/src/tmp/rpmb-tmp.dtkc9y (%install)
2026-Jul-27 19:23:23 :: [aarch64] samba.git 4.23.8-alt1: remote: build failed
2026-Jul-27 19:23:23 :: [aarch64] #270 samba.git 4.23.8-alt1: build FAILED
2026-Jul-27 19:15:23 :: [x86_64] build FAILED
2026-Jul-27 19:16:53 :: [i586] build FAILED
2026-Jul-27 19:23:24 :: [aarch64] build FAILED
2026-Jul-27 19:23:24 :: task #408845 for sisyphus FAILED


More information about the Sisyphus-incominger mailing list