[#427163] [test-only] p10 FAILED python3-module-numexpr.git=2.14.1-alt1

Girar awaiter (toni) girar-builder at altlinux.org
Mon Jul 27 14:44:07 MSK 2026


https://git.altlinux.org/tasks/427163/logs/events.1.1.log
https://packages.altlinux.org/tasks/427163

subtask  name                    aarch64    armh    i586  x86_64
   #100  python3-module-numexpr   failed  failed  failed  failed

2026-Jul-27 11:42:44 :: test-only task #427163 for p10 started by toni:
#100 build 2.14.1-alt1 from /gears/p/python3-module-numexpr.git fetched at 2026-Jul-27 11:42:26 from sisyphus
2026-Jul-27 11:42:47 :: [aarch64] #100 python3-module-numexpr.git 2.14.1-alt1: build start
2026-Jul-27 11:42:47 :: [x86_64] #100 python3-module-numexpr.git 2.14.1-alt1: build start
2026-Jul-27 11:42:47 :: [i586] #100 python3-module-numexpr.git 2.14.1-alt1: build start
2026-Jul-27 11:42:47 :: [armh] #100 python3-module-numexpr.git 2.14.1-alt1: build start
[x86_64] Processing ./.tox/.tmp/package/1/UNKNOWN-2.14.1-cp39-cp39-linux_x86_64.whl
[x86_64] ERROR: Could not find a version that satisfies the requirement numpy>=1.26.0 (from unknown) (from versions: none)
[x86_64] ERROR: No matching distribution found for numpy>=1.26.0
[x86_64] ERROR: invocation failed (exit code 1)
[x86_64] py3 finish: installpkg /usr/src/RPM/BUILD/python3-module-numexpr-2.14.1/.tox/.tmp/package/1/UNKNOWN-2.14.1-cp39-cp39-linux_x86_64.whl after 0.69 seconds
[x86_64] ___________________________________ summary ____________________________________
[x86_64] ERROR:   py3: InvocationError for command /usr/src/RPM/BUILD/python3-module-numexpr-2.14.1/.tox/py3/bin/python -m pip install --exists-action w .tox/.tmp/package/1/UNKNOWN-2.14.1-cp39-cp39-linux_x86_64.whl (exited with code 1)
[x86_64] cleanup /usr/src/RPM/BUILD/python3-module-numexpr-2.14.1/.tox/.tmp/package/1/UNKNOWN-2.14.1-cp39-cp39-linux_x86_64.whl
2026-Jul-27 11:43:18 :: [x86_64] python3-module-numexpr.git 2.14.1-alt1: remote: build failed
2026-Jul-27 11:43:18 :: [x86_64] #100 python3-module-numexpr.git 2.14.1-alt1: build FAILED
2026-Jul-27 11:43:19 :: [x86_64] requesting cancellation of task processing
[i586] Processing ./.tox/.tmp/package/1/UNKNOWN-2.14.1-cp39-cp39-linux_i686.whl
[i586] ERROR: Could not find a version that satisfies the requirement numpy>=1.26.0 (from unknown) (from versions: none)
[i586] ERROR: No matching distribution found for numpy>=1.26.0
[i586] ERROR: invocation failed (exit code 1)
[i586] py3 finish: installpkg /usr/src/RPM/BUILD/python3-module-numexpr-2.14.1/.tox/.tmp/package/1/UNKNOWN-2.14.1-cp39-cp39-linux_i686.whl after 0.79 seconds
[i586] ___________________________________ summary ____________________________________
[i586] ERROR:   py3: InvocationError for command /usr/src/RPM/BUILD/python3-module-numexpr-2.14.1/.tox/py3/bin/python -m pip install --exists-action w .tox/.tmp/package/1/UNKNOWN-2.14.1-cp39-cp39-linux_i686.whl (exited with code 1)
[i586] cleanup /usr/src/RPM/BUILD/python3-module-numexpr-2.14.1/.tox/.tmp/package/1/UNKNOWN-2.14.1-cp39-cp39-linux_i686.whl
2026-Jul-27 11:43:20 :: [i586] python3-module-numexpr.git 2.14.1-alt1: remote: build failed
2026-Jul-27 11:43:20 :: [i586] #100 python3-module-numexpr.git 2.14.1-alt1: build FAILED
[aarch64] Processing ./.tox/.tmp/package/1/UNKNOWN-2.14.1-cp39-cp39-linux_aarch64.whl
[aarch64] ERROR: Could not find a version that satisfies the requirement numpy>=1.26.0 (from unknown) (from versions: none)
[aarch64] ERROR: No matching distribution found for numpy>=1.26.0
[aarch64] ERROR: invocation failed (exit code 1)
[aarch64] py3 finish: installpkg /usr/src/RPM/BUILD/python3-module-numexpr-2.14.1/.tox/.tmp/package/1/UNKNOWN-2.14.1-cp39-cp39-linux_aarch64.whl after 1.37 seconds
[aarch64] ___________________________________ summary ____________________________________
[aarch64] ERROR:   py3: InvocationError for command /usr/src/RPM/BUILD/python3-module-numexpr-2.14.1/.tox/py3/bin/python -m pip install --exists-action w .tox/.tmp/package/1/UNKNOWN-2.14.1-cp39-cp39-linux_aarch64.whl (exited with code 1)
[aarch64] cleanup /usr/src/RPM/BUILD/python3-module-numexpr-2.14.1/.tox/.tmp/package/1/UNKNOWN-2.14.1-cp39-cp39-linux_aarch64.whl
2026-Jul-27 11:43:42 :: [aarch64] python3-module-numexpr.git 2.14.1-alt1: remote: build failed
2026-Jul-27 11:43:42 :: [aarch64] #100 python3-module-numexpr.git 2.14.1-alt1: build FAILED
[armh] Processing ./.tox/.tmp/package/1/UNKNOWN-2.14.1-cp39-cp39-linux_armv8l.whl
[armh] ERROR: Could not find a version that satisfies the requirement numpy>=1.26.0 (from unknown) (from versions: none)
[armh] ERROR: No matching distribution found for numpy>=1.26.0
[armh] ERROR: invocation failed (exit code 1)
[armh] py3 finish: installpkg /usr/src/RPM/BUILD/python3-module-numexpr-2.14.1/.tox/.tmp/package/1/UNKNOWN-2.14.1-cp39-cp39-linux_armv8l.whl after 2.38 seconds
[armh] ___________________________________ summary ____________________________________
[armh] ERROR:   py3: InvocationError for command /usr/src/RPM/BUILD/python3-module-numexpr-2.14.1/.tox/py3/bin/python -m pip install --exists-action w .tox/.tmp/package/1/UNKNOWN-2.14.1-cp39-cp39-linux_armv8l.whl (exited with code 1)
[armh] cleanup /usr/src/RPM/BUILD/python3-module-numexpr-2.14.1/.tox/.tmp/package/1/UNKNOWN-2.14.1-cp39-cp39-linux_armv8l.whl
2026-Jul-27 11:44:07 :: [armh] python3-module-numexpr.git 2.14.1-alt1: remote: build failed
2026-Jul-27 11:44:07 :: [armh] #100 python3-module-numexpr.git 2.14.1-alt1: build FAILED
2026-Jul-27 11:43:19 :: [x86_64] build FAILED
2026-Jul-27 11:43:20 :: [i586] build FAILED
2026-Jul-27 11:43:42 :: [aarch64] build FAILED
2026-Jul-27 11:44:07 :: [armh] build FAILED
2026-Jul-27 11:44:07 :: task #427163 for p10 FAILED


More information about the Sisyphus-incominger mailing list