[#427092] FAILED apt-conf-yandex-browser.git=1.0-alt4

Girar awaiter (nenderus) girar-builder at altlinux.org
Sun Jul 26 14:32:00 MSK 2026


https://git.altlinux.org/tasks/427092/logs/events.1.1.log
https://packages.altlinux.org/tasks/427092

subtask  name                     aarch64  i586  x86_64
   #100  apt-conf-yandex-browser        -     -  failed

2026-Jul-26 11:31:45 :: task #427092 for sisyphus started by nenderus:
#100 build 1.0-alt4 from /people/nenderus/packages/apt-conf-yandex-browser.git fetched at 2026-Jul-26 11:31:43
2026-Jul-26 11:31:46 :: [x86_64] #100 apt-conf-yandex-browser.git 1.0-alt4: build start
2026-Jul-26 11:31:46 :: [i586] #100 apt-conf-yandex-browser.git 1.0-alt4: build start
2026-Jul-26 11:31:46 :: [aarch64] #100 apt-conf-yandex-browser.git 1.0-alt4: build start
[x86_64] /usr/src/in/srpm/apt-conf-yandex-browser-1.0-alt4.src.rpm: wrong CHANGELOGNAME: expected "1.0-alt4", found "1.0-alt3"
[x86_64] sisyphus_check: check-changelog ERROR: changelog format violation
[x86_64] /usr/src/in/srpm/apt-conf-yandex-browser-1.0-alt4.src.rpm: license not found in '/usr/share/license' directory: Public-Domain
[x86_64] hsh-rebuild: apt-conf-yandex-browser-1.0-alt4.src.rpm: sisyphus_check failed.
2026-Jul-26 11:31:53 :: [x86_64] apt-conf-yandex-browser.git 1.0-alt4: remote: build failed
2026-Jul-26 11:31:53 :: [x86_64] #100 apt-conf-yandex-browser.git 1.0-alt4: build FAILED
2026-Jul-26 11:31:53 :: [x86_64] requesting cancellation of task processing
2026-Jul-26 11:31:56 :: [i586] #100 apt-conf-yandex-browser.git 1.0-alt4: build SKIPPED
2026-Jul-26 11:31:59 :: [aarch64] #100 apt-conf-yandex-browser.git 1.0-alt4: build SKIPPED
2026-Jul-26 11:31:53 :: [x86_64] build FAILED
2026-Jul-26 11:31:59 :: task #427092 for sisyphus FAILED


More information about the Sisyphus-incominger mailing list