[#426998] FAILED regard3d.git=1.0.0-alt2

Girar awaiter (iv) girar-builder at altlinux.org
Sat Jul 25 14:47:24 MSK 2026


https://git.altlinux.org/tasks/426998/logs/events.1.1.log
https://packages.altlinux.org/tasks/426998

subtask  name      aarch64    i586  x86_64
   #100  regard3d   failed  failed  failed

2026-Jul-25 11:46:07 :: task #426998 for sisyphus started by iv:
2026-Jul-25 11:46:07 :: message: rebuild_with_boost_1.91
#100 build 1.0.0-alt2 from /gears/r/regard3d.git fetched at 2026-Jul-25 09:27:18 from sisyphus
2026-Jul-25 11:46:10 :: [x86_64] #100 regard3d.git 1.0.0-alt2: build start
2026-Jul-25 11:46:10 :: [i586] #100 regard3d.git 1.0.0-alt2: build start
2026-Jul-25 11:46:10 :: [aarch64] #100 regard3d.git 1.0.0-alt2: build start
[x86_64]   "boost_system" provides a separate development package or SDK, be sure it
[x86_64]   has been installed.
[x86_64] Call Stack (most recent call first):
[x86_64]   /usr/lib64/cmake/Boost-1.91.0/BoostConfig.cmake:262 (boost_find_component)
[x86_64]   /usr/share/cmake/Modules/FindBoost.cmake:610 (find_package)
[x86_64]   CMakeLists.txt:202 (FIND_PACKAGE)
[x86_64] -- Configuring incomplete, errors occurred!
[x86_64] error: Bad exit status from /usr/src/tmp/rpmb-tmp.kSjtQQ (%build)
[x86_64] RPM build errors:
[x86_64]     Bad exit status from /usr/src/tmp/rpmb-tmp.kSjtQQ (%build)
2026-Jul-25 11:46:53 :: [x86_64] regard3d.git 1.0.0-alt2: remote: build failed
2026-Jul-25 11:46:53 :: [x86_64] #100 regard3d.git 1.0.0-alt2: build FAILED
2026-Jul-25 11:46:53 :: [x86_64] requesting cancellation of task processing
[i586]   "boost_system" provides a separate development package or SDK, be sure it
[i586]   has been installed.
[i586] Call Stack (most recent call first):
[i586]   /usr/lib/cmake/Boost-1.91.0/BoostConfig.cmake:262 (boost_find_component)
[i586]   /usr/share/cmake/Modules/FindBoost.cmake:610 (find_package)
[i586]   CMakeLists.txt:202 (FIND_PACKAGE)
[i586] -- Configuring incomplete, errors occurred!
[i586] error: Bad exit status from /usr/src/tmp/rpmb-tmp.b3FquO (%build)
[i586] RPM build errors:
[i586]     Bad exit status from /usr/src/tmp/rpmb-tmp.b3FquO (%build)
2026-Jul-25 11:46:54 :: [i586] regard3d.git 1.0.0-alt2: remote: build failed
2026-Jul-25 11:46:54 :: [i586] #100 regard3d.git 1.0.0-alt2: build FAILED
[aarch64]   "boost_system" provides a separate development package or SDK, be sure it
[aarch64]   has been installed.
[aarch64] Call Stack (most recent call first):
[aarch64]   /usr/lib64/cmake/Boost-1.91.0/BoostConfig.cmake:262 (boost_find_component)
[aarch64]   /usr/share/cmake/Modules/FindBoost.cmake:610 (find_package)
[aarch64]   CMakeLists.txt:202 (FIND_PACKAGE)
[aarch64] -- Configuring incomplete, errors occurred!
[aarch64] error: Bad exit status from /usr/src/tmp/rpmb-tmp.ldNOjj (%build)
[aarch64] RPM build errors:
[aarch64]     Bad exit status from /usr/src/tmp/rpmb-tmp.ldNOjj (%build)
2026-Jul-25 11:47:23 :: [aarch64] regard3d.git 1.0.0-alt2: remote: build failed
2026-Jul-25 11:47:23 :: [aarch64] #100 regard3d.git 1.0.0-alt2: build FAILED
2026-Jul-25 11:46:53 :: [x86_64] build FAILED
2026-Jul-25 11:46:54 :: [i586] build FAILED
2026-Jul-25 11:47:23 :: [aarch64] build FAILED
2026-Jul-25 11:47:24 :: task #426998 for sisyphus FAILED


More information about the Sisyphus-incominger mailing list