[#426928] FAILED LuxCore.git=2.10.0-alt2.ga342e1e68

Girar awaiter (iv) girar-builder at altlinux.org
Sat Jul 25 12:26:07 MSK 2026


https://git.altlinux.org/tasks/426928/logs/events.1.1.log
https://packages.altlinux.org/tasks/426928

subtask  name     aarch64  i586  x86_64
   #100  LuxCore   failed     -  failed

2026-Jul-25 09:23:17 :: task #426928 for sisyphus started by iv:
2026-Jul-25 09:23:17 :: message: rebuild_with_boost_1.91
#100 build 2.10.0-alt2.ga342e1e68 from /gears/L/LuxCore.git fetched at 2026-Jul-25 09:23:13 from sisyphus
2026-Jul-25 09:23:19 :: [x86_64] #100 LuxCore.git 2.10.0-alt2.ga342e1e68: build start
2026-Jul-25 09:23:19 :: [i586] #100 LuxCore.git 2.10.0-alt2.ga342e1e68: build start
2026-Jul-25 09:23:19 :: [aarch64] #100 LuxCore.git 2.10.0-alt2.ga342e1e68: build start
2026-Jul-25 09:23:29 :: [i586] #100 LuxCore.git 2.10.0-alt2.ga342e1e68: build SKIPPED
[x86_64] ++ grep -Rl '#!.*python$' AUTHORS.txt CMakeLists.txt CMakeLists.txt.orig COPYING.txt Configuration.cmake README.md azure-pipelines.yml cmake deps doxygen include release-notes.txt samples scenes scripts sdk src tests
[x86_64] grep: deps/perceptualdiff-master/.clang_complete: No such file or directory
[x86_64] + subst '/^#!.*python$/s|python$|python3|' samples/pysideluxcoredemo/pysideluxcoredemo.py samples/pyluxcoretool/pyluxcoretool.py samples/pyluxcoreserializationdemo/pyluxcoreserializationdemo.py samples/pyluxcoredemo/pyluxcoredemo.py scenes/cornell/cornell-anim.py src/pyluxcoretools/pyluxcoretools/utils/netbeacon.py src/pyluxcoretools/pyluxcoretools/renderfarm/renderfarmnode.py src/pyluxcoretools/pyluxcoretools/renderfarm/renderfarmjobsingleimage.py src/pyluxcoretools/pyluxcoretools/renderfarm/renderfarmfilmmerger.py src/pyluxcoretools/pyluxcoretools/renderfarm/renderfarm.py src/pyluxcoretools/pyluxcoretools/pyluxcorenetnode/ui.py src/pyluxcoretools/pyluxcoretools/pyluxcorenetnode/cmd.py src/pyluxcoretools/pyluxcoretools/pyluxcorenetconsole/ui.py src/pyluxcoretools/pyluxcoretools/pyluxcorenetconsole/cmd.py src/pyluxcoretools/pyluxcoretools/pyluxcoremerge/cmd.py src/pyluxcoretools/pyluxcoretools/pyluxcoremenu/cmd.py src/pyluxcoretools/pyluxcoretools/pyluxcoremaketx/cmd.py src/pyluxcoretools/pyluxcoretools/pyluxcoreconsole/cmd.py tests/pymemoryleaktest/pymemoryleaktest.py
[x86_64] --
[x86_64] --   Found gtk+-3.0, version 3.24.53
[x86_64] Package libpcre2-8 was not found in the pkg-config search path.
[x86_64] Perhaps you should add the directory containing `libpcre2-8.pc'
[x86_64] to the PKG_CONFIG_PATH environment variable
[x86_64] Package 'libpcre2-8', required by 'glib-2.0', not found
[x86_64] Package libpcre2-8 was not found in the pkg-config search path.
[x86_64] Perhaps you should add the directory containing `libpcre2-8.pc'
[x86_64] to the PKG_CONFIG_PATH environment variable
[x86_64] Package 'libpcre2-8', required by 'glib-2.0', not found
[x86_64] Package libpcre2-8 was not found in the pkg-config search path.
[x86_64] Perhaps you should add the directory containing `libpcre2-8.pc'
[x86_64] to the PKG_CONFIG_PATH environment variable
[x86_64] Package 'libpcre2-8', required by 'glib-2.0', not found
[x86_64] Package libpcre2-8 was not found in the pkg-config search path.
[x86_64] Perhaps you should add the directory containing `libpcre2-8.pc'
[x86_64] to the PKG_CONFIG_PATH environment variable
[x86_64] Package 'libpcre2-8', required by 'glib-2.0', not found
[x86_64] -- Found BISON: /usr/bin/bison (found version "3.8.2")
2026-Jul-25 09:25:10 :: [x86_64] LuxCore.git 2.10.0-alt2.ga342e1e68: remote: build failed
2026-Jul-25 09:25:10 :: [x86_64] #100 LuxCore.git 2.10.0-alt2.ga342e1e68: build FAILED
2026-Jul-25 09:25:10 :: [x86_64] requesting cancellation of task processing
[aarch64] ++ grep -Rl '#!.*python$' AUTHORS.txt CMakeLists.txt CMakeLists.txt.orig COPYING.txt Configuration.cmake README.md azure-pipelines.yml cmake deps doxygen include release-notes.txt samples scenes scripts sdk src tests
[aarch64] grep: deps/perceptualdiff-master/.clang_complete: No such file or directory
[aarch64] + subst '/^#!.*python$/s|python$|python3|' samples/pysideluxcoredemo/pysideluxcoredemo.py samples/pyluxcoretool/pyluxcoretool.py samples/pyluxcoreserializationdemo/pyluxcoreserializationdemo.py samples/pyluxcoredemo/pyluxcoredemo.py scenes/cornell/cornell-anim.py src/pyluxcoretools/pyluxcoretools/utils/netbeacon.py src/pyluxcoretools/pyluxcoretools/renderfarm/renderfarmnode.py src/pyluxcoretools/pyluxcoretools/renderfarm/renderfarmjobsingleimage.py src/pyluxcoretools/pyluxcoretools/renderfarm/renderfarmfilmmerger.py src/pyluxcoretools/pyluxcoretools/renderfarm/renderfarm.py src/pyluxcoretools/pyluxcoretools/pyluxcorenetnode/ui.py src/pyluxcoretools/pyluxcoretools/pyluxcorenetnode/cmd.py src/pyluxcoretools/pyluxcoretools/pyluxcorenetconsole/ui.py src/pyluxcoretools/pyluxcoretools/pyluxcorenetconsole/cmd.py src/pyluxcoretools/pyluxcoretools/pyluxcoremerge/cmd.py src/pyluxcoretools/pyluxcoretools/pyluxcoremenu/cmd.py src/pyluxcoretools/pyluxcoretools/pyluxcoremaketx/cmd.py src/pyluxcoretools/pyluxcoretools/pyluxcoreconsole/cmd.py tests/pymemoryleaktest/pymemoryleaktest.py
[aarch64] --
[aarch64] --   Found gtk+-3.0, version 3.24.53
[aarch64] Package libpcre2-8 was not found in the pkg-config search path.
[aarch64] Perhaps you should add the directory containing `libpcre2-8.pc'
[aarch64] to the PKG_CONFIG_PATH environment variable
[aarch64] Package 'libpcre2-8', required by 'glib-2.0', not found
[aarch64] Package libpcre2-8 was not found in the pkg-config search path.
[aarch64] Perhaps you should add the directory containing `libpcre2-8.pc'
[aarch64] to the PKG_CONFIG_PATH environment variable
[aarch64] Package 'libpcre2-8', required by 'glib-2.0', not found
[aarch64] Package libpcre2-8 was not found in the pkg-config search path.
[aarch64] Perhaps you should add the directory containing `libpcre2-8.pc'
[aarch64] to the PKG_CONFIG_PATH environment variable
[aarch64] Package 'libpcre2-8', required by 'glib-2.0', not found
[aarch64] Package libpcre2-8 was not found in the pkg-config search path.
[aarch64] Perhaps you should add the directory containing `libpcre2-8.pc'
[aarch64] to the PKG_CONFIG_PATH environment variable
[aarch64] Package 'libpcre2-8', required by 'glib-2.0', not found
[aarch64] -- Found BISON: /usr/bin/bison (found version "3.8.2")
2026-Jul-25 09:26:07 :: [aarch64] LuxCore.git 2.10.0-alt2.ga342e1e68: remote: build failed
2026-Jul-25 09:26:07 :: [aarch64] #100 LuxCore.git 2.10.0-alt2.ga342e1e68: build FAILED
2026-Jul-25 09:25:10 :: [x86_64] build FAILED
2026-Jul-25 09:26:07 :: [aarch64] build FAILED
2026-Jul-25 09:26:07 :: task #426928 for sisyphus FAILED


More information about the Sisyphus-incominger mailing list