[#379525] FAILED alt-components-base.git=0.6.0-alt1

Girar awaiter (sin) girar-builder at altlinux.org
Sat Mar 29 00:53:00 MSK 2025


https://git.altlinux.org/tasks/379525/logs/events.1.1.log
https://packages.altlinux.org/tasks/379525

subtask  name                 aarch64    i586  x86_64
   #100  alt-components-base   failed  failed  failed

2025-Mar-28 21:51:16 :: task #379525 for sisyphus started by sin:
#100 build 0.6.0-alt1 from /people/sin/packages/alt-components-base.git fetched at 2025-Mar-28 21:51:14
2025-Mar-28 21:51:17 :: [aarch64] #100 alt-components-base.git 0.6.0-alt1: build start
2025-Mar-28 21:51:17 :: [x86_64] #100 alt-components-base.git 0.6.0-alt1: build start
2025-Mar-28 21:51:17 :: [i586] #100 alt-components-base.git 0.6.0-alt1: build start
[x86_64] /.out/alt-components-base-0.6.0-alt1.noarch.rpm: unpackaged directory: /usr/share/alterator/components/categories
[x86_64] sisyphus_check: check-subdirs ERROR: subdirectories packaging violation
[x86_64] hsh-rebuild: alt-components-base-0.6.0-alt1.src.rpm: sisyphus_check failed.
2025-Mar-28 21:52:21 :: [x86_64] alt-components-base.git 0.6.0-alt1: remote: build failed
2025-Mar-28 21:52:21 :: [x86_64] #100 alt-components-base.git 0.6.0-alt1: build FAILED
2025-Mar-28 21:52:21 :: [x86_64] requesting cancellation of task processing
[i586] /.out/alt-components-base-0.6.0-alt1.noarch.rpm: unpackaged directory: /usr/share/alterator/components/categories
[i586] sisyphus_check: check-subdirs ERROR: subdirectories packaging violation
[i586] hsh-rebuild: alt-components-base-0.6.0-alt1.src.rpm: sisyphus_check failed.
2025-Mar-28 21:52:24 :: [i586] alt-components-base.git 0.6.0-alt1: remote: build failed
2025-Mar-28 21:52:24 :: [i586] #100 alt-components-base.git 0.6.0-alt1: build FAILED
[aarch64] /.out/alt-components-base-0.6.0-alt1.noarch.rpm: unpackaged directory: /usr/share/alterator/components/categories
[aarch64] sisyphus_check: check-subdirs ERROR: subdirectories packaging violation
[aarch64] hsh-rebuild: alt-components-base-0.6.0-alt1.src.rpm: sisyphus_check failed.
2025-Mar-28 21:53:00 :: [aarch64] alt-components-base.git 0.6.0-alt1: remote: build failed
2025-Mar-28 21:53:00 :: [aarch64] #100 alt-components-base.git 0.6.0-alt1: build FAILED
2025-Mar-28 21:52:21 :: [x86_64] build FAILED
2025-Mar-28 21:52:24 :: [i586] build FAILED
2025-Mar-28 21:53:00 :: [aarch64] build FAILED
2025-Mar-28 21:53:00 :: task #379525 for sisyphus FAILED


More information about the Sisyphus-incominger mailing list