[#379137] FAILED mbedtls.git=3.6.3-alt1

Girar awaiter (nenderus) girar-builder at altlinux.org
Mon Mar 24 23:06:06 MSK 2025


https://git.altlinux.org/tasks/379137/logs/events.1.1.log
https://packages.altlinux.org/tasks/379137

subtask  name     aarch64  i586  x86_64
   #100  mbedtls   failed  1:36    1:32

2025-Mar-24 20:03:20 :: task #379137 for sisyphus started by nenderus:
#100 build 3.6.3-alt1 from /people/nenderus/packages/mbedtls.git fetched at 2025-Mar-24 20:03:19
2025-Mar-24 20:03:20 :: waiting for a shared lock on sisyphus
2025-Mar-24 20:04:28 :: acquired a shared lock on sisyphus
2025-Mar-24 20:04:30 :: [x86_64] #100 mbedtls.git 3.6.3-alt1: build start
2025-Mar-24 20:04:30 :: [i586] #100 mbedtls.git 3.6.3-alt1: build start
2025-Mar-24 20:04:30 :: [aarch64] #100 mbedtls.git 3.6.3-alt1: build start
[aarch64]     inlined from 'ctr_drbg_update_internal' at /usr/src/RPM/BUILD/mbedtls-3.6.3/library/ctr_drbg.c:372:5:
[aarch64] /usr/src/RPM/BUILD/mbedtls-3.6.3/library/common.h:235:17: error: array subscript 48 is outside array bounds of 'unsigned char[48]' [-Werror=array-bounds=]
[aarch64]   235 |         r[i] = a[i] ^ b[i];
[aarch64] --
[aarch64]     inlined from 'ctr_drbg_update_internal' at /usr/src/RPM/BUILD/mbedtls-3.6.3/library/ctr_drbg.c:372:5:
[aarch64] /usr/src/RPM/BUILD/mbedtls-3.6.3/library/common.h:235:24: error: array subscript 48 is outside array bounds of 'const unsigned char[48]' [-Werror=array-bounds=]
[aarch64]   235 |         r[i] = a[i] ^ b[i];
[aarch64] --
[aarch64]     inlined from 'ctr_drbg_update_internal' at /usr/src/RPM/BUILD/mbedtls-3.6.3/library/ctr_drbg.c:372:5:
[aarch64] /usr/src/RPM/BUILD/mbedtls-3.6.3/library/common.h:235:14: error: array subscript 48 is outside array bounds of 'unsigned char[48]' [-Werror=array-bounds=]
[aarch64]   235 |         r[i] = a[i] ^ b[i];
[aarch64] --
[aarch64]   335 |     unsigned char tmp[MBEDTLS_CTR_DRBG_SEEDLEN];
[aarch64] cc1: all warnings being treated as errors
[aarch64] gmake[2]: *** [library/CMakeFiles/mbedcrypto.dir/build.make:359: library/CMakeFiles/mbedcrypto.dir/ctr_drbg.c.o] Error 1
2025-Mar-24 20:05:22 :: [aarch64] mbedtls.git 3.6.3-alt1: remote: build failed
2025-Mar-24 20:05:22 :: [aarch64] #100 mbedtls.git 3.6.3-alt1: build FAILED
2025-Mar-24 20:05:22 :: [aarch64] requesting cancellation of task processing
2025-Mar-24 20:06:02 :: [x86_64] #100 mbedtls.git 3.6.3-alt1: build OK
2025-Mar-24 20:06:06 :: [i586] #100 mbedtls.git 3.6.3-alt1: build OK
2025-Mar-24 20:05:22 :: [aarch64] build FAILED
2025-Mar-24 20:06:06 :: task #379137 for sisyphus FAILED


More information about the Sisyphus-incominger mailing list