[#379127] FAILED kernel-image.git=kernel-image-6.14-6.14.0-alt1 ...

Girar awaiter (kernelbot) girar-builder at altlinux.org
Mon Mar 24 20:33:18 MSK 2025


https://git.altlinux.org/tasks/379127/logs/events.1.1.log
https://packages.altlinux.org/tasks/379127

subtask  name          aarch64    i586  x86_64
   #100  kernel-image   failed  failed  failed

2025-Mar-24 17:00:27 :: task #379127 for sisyphus started by kernelbot:
2025-Mar-24 17:00:27 :: message: kmodules:kernel-image-6.14-6.14.0-alt1
#100 build kernel-image-6.14-6.14.0-alt1 from /people/kernelbot/packages/kernel-image.git fetched at 2025-Mar-24 17:00:23
#200 build sisyphus/kernel-modules-r8168-6.14-8.055.00-alt1.k from /gears/k/kernel-modules-r8168-6.14.git fetched at 2025-Mar-24 17:00:24 from sisyphus
#300 build sisyphus/kernel-modules-vhba-6.14-20240917-alt1.k from /gears/k/kernel-modules-vhba-6.14.git fetched at 2025-Mar-24 17:00:25 from sisyphus
2025-Mar-24 17:00:27 :: waiting for a shared lock on sisyphus
2025-Mar-24 17:01:21 :: acquired a shared lock on sisyphus
2025-Mar-24 17:01:22 :: created build repo
2025-Mar-24 17:01:23 :: [i586] #100 kernel-image.git kernel-image-6.14-6.14.0-alt1: build start
2025-Mar-24 17:01:23 :: [aarch64] #100 kernel-image.git kernel-image-6.14-6.14.0-alt1: build start
2025-Mar-24 17:01:23 :: [x86_64] #100 kernel-image.git kernel-image-6.14-6.14.0-alt1: build start
[i586] + mv /usr/src/tmp/kernel-image-6.14-buildroot/lib/modules/6.14.0-6.14-alt1/kernel/drivers/media/common/videobuf2/ /usr/src/tmp/kernel-image-6.14-buildroot/lib/modules/6.14.0-6.14-alt1/kernel/drivers/media-core/
[i586] mv: cannot stat '/usr/src/tmp/kernel-image-6.14-buildroot/lib/modules/6.14.0-6.14-alt1/kernel/drivers/media/common/videobuf2/': No such file or directory
2025-Mar-24 17:16:02 :: [i586] kernel-image.git kernel-image-6.14-6.14.0-alt1: remote: build failed
2025-Mar-24 17:16:02 :: [i586] #100 kernel-image.git kernel-image-6.14-6.14.0-alt1: build FAILED
[x86_64] + mv /usr/src/tmp/kernel-image-6.14-buildroot/lib/modules/6.14.0-6.14-alt1/kernel/drivers/media/common/videobuf2/ /usr/src/tmp/kernel-image-6.14-buildroot/lib/modules/6.14.0-6.14-alt1/kernel/drivers/media-core/
[x86_64] mv: cannot stat '/usr/src/tmp/kernel-image-6.14-buildroot/lib/modules/6.14.0-6.14-alt1/kernel/drivers/media/common/videobuf2/': No such file or directory
2025-Mar-24 17:16:31 :: [x86_64] kernel-image.git kernel-image-6.14-6.14.0-alt1: remote: build failed
2025-Mar-24 17:16:31 :: [x86_64] #100 kernel-image.git kernel-image-6.14-6.14.0-alt1: build FAILED
[aarch64] + mv /usr/src/tmp/kernel-image-6.14-buildroot/lib/modules/6.14.0-6.14-alt1/kernel/drivers/media/common/videobuf2/ /usr/src/tmp/kernel-image-6.14-buildroot/lib/modules/6.14.0-6.14-alt1/kernel/drivers/media-core/
[aarch64] mv: cannot stat '/usr/src/tmp/kernel-image-6.14-buildroot/lib/modules/6.14.0-6.14-alt1/kernel/drivers/media/common/videobuf2/': No such file or directory
2025-Mar-24 17:33:17 :: [aarch64] kernel-image.git kernel-image-6.14-6.14.0-alt1: remote: build failed
2025-Mar-24 17:33:17 :: [aarch64] #100 kernel-image.git kernel-image-6.14-6.14.0-alt1: build FAILED
2025-Mar-24 17:16:02 :: [i586] build FAILED
2025-Mar-24 17:16:31 :: [x86_64] build FAILED
2025-Mar-24 17:33:18 :: [aarch64] build FAILED
2025-Mar-24 17:33:18 :: task #379127 for sisyphus FAILED


More information about the Sisyphus-incominger mailing list