[#379109] [test-only] FAILED (try 2) ftxui.git=6.0.0-alt1 pciex.git=0.0.2-alt1

Girar awaiter (serjigva) girar-builder at altlinux.org
Mon Mar 24 16:50:21 MSK 2025


https://git.altlinux.org/tasks/379109/logs/events.2.1.log
https://packages.altlinux.org/tasks/379109

subtask  name   aarch64    i586  x86_64
   #200  pciex   failed  failed  failed

2025-Mar-24 13:48:49 :: test-only task #379109 for sisyphus resumed by serjigva:
2025-Mar-24 13:48:49 :: message: ftxui_new_version
#100 build 6.0.0-alt1 from /people/serjigva/packages/ftxui.git fetched at 2025-Mar-24 13:42:53
#200 build 0.0.2-alt1 from /gears/p/pciex.git fetched at 2025-Mar-24 13:48:09 from sisyphus
2025-Mar-24 13:48:50 :: created build repo
2025-Mar-24 13:48:51 :: [x86_64] #100 ftxui.git 6.0.0-alt1: build start
2025-Mar-24 13:48:51 :: [i586] #100 ftxui.git 6.0.0-alt1: build start
2025-Mar-24 13:48:51 :: [aarch64] #100 ftxui.git 6.0.0-alt1: build start
2025-Mar-24 13:49:09 :: [i586] #100 ftxui.git 6.0.0-alt1: build OK (cached)
2025-Mar-24 13:49:09 :: [i586] #200 pciex.git 0.0.2-alt1: build start
2025-Mar-24 13:49:09 :: [x86_64] #100 ftxui.git 6.0.0-alt1: build OK (cached)
2025-Mar-24 13:49:10 :: [x86_64] #200 pciex.git 0.0.2-alt1: build start
2025-Mar-24 13:49:28 :: [aarch64] #100 ftxui.git 6.0.0-alt1: build OK (cached)
2025-Mar-24 13:49:28 :: [aarch64] #200 pciex.git 0.0.2-alt1: build start
[i586]                  from /usr/src/RPM/BUILD/pciex-0.0.2/src/ui/ext_cap_comp.cpp:4:
[i586] /usr/src/RPM/BUILD/pciex-0.0.2/src/ui/common_comp.h:20:20: error: 'ftxui::Element ui::PushPullButton::Render()' marked 'override', but does not override
[i586]    20 |     ftxui::Element Render() override;
[i586] --
[i586]                  from /usr/src/RPM/BUILD/pciex-0.0.2/src/ui/compat_cap_comp.cpp:7:
[i586] /usr/src/RPM/BUILD/pciex-0.0.2/src/ui/common_comp.h:20:20: error: 'ftxui::Element ui::PushPullButton::Render()' marked 'override', but does not override
[i586]    20 |     ftxui::Element Render() override;
[i586] --
[i586] In file included from /usr/src/RPM/BUILD/pciex-0.0.2/src/main.cpp:11:
[i586] /usr/src/RPM/BUILD/pciex-0.0.2/src/ui/screen.h:212:20: error: 'ftxui::Element ui::PCITopoUIComp::Render()' marked 'override', but does not override
[i586]   212 |     ftxui::Element Render() override final;
[i586] /usr/src/RPM/BUILD/pciex-0.0.2/src/ui/screen.h:212:20: error: 'ftxui::Element ui::PCITopoUIComp::Render()' marked 'final', but is not virtual
[i586] /usr/src/RPM/BUILD/pciex-0.0.2/src/ui/screen.h:275:20: error: 'ftxui::Element ui::ScrollableComp::Render()' marked 'override', but does not override
[i586]   275 |     ftxui::Element Render() override final;
[i586] /usr/src/RPM/BUILD/pciex-0.0.2/src/ui/screen.h:275:20: error: 'ftxui::Element ui::ScrollableComp::Render()' marked 'final', but is not virtual
[i586] /usr/src/RPM/BUILD/pciex-0.0.2/src/ui/screen.h:302:20: error: 'ftxui::Element ui::PCIRegsComponent::Render()' marked 'override', but does not override
[i586]   302 |     ftxui::Element Render() override;
[i586] /usr/src/RPM/BUILD/pciex-0.0.2/src/ui/screen.h:325:20: error: 'ftxui::Element ui::BorderedHoverComp::Render()' marked 'override', but does not override
[i586]   325 |     ftxui::Element Render() override final;
[i586] /usr/src/RPM/BUILD/pciex-0.0.2/src/ui/screen.h:325:20: error: 'ftxui::Element ui::BorderedHoverComp::Render()' marked 'final', but is not virtual
[i586] gmake[2]: *** [CMakeFiles/pciex.dir/build.make:135: CMakeFiles/pciex.dir/src/main.cpp.o] Error 1
[i586] --
[i586] In file included from /usr/src/RPM/BUILD/pciex-0.0.2/src/ui/common_comp.cpp:7:
[i586] /usr/src/RPM/BUILD/pciex-0.0.2/src/ui/common_comp.h:20:20: error: 'ftxui::Element ui::PushPullButton::Render()' marked 'override', but does not override
[i586]    20 |     ftxui::Element Render() override;
2025-Mar-24 13:49:35 :: [i586] pciex.git 0.0.2-alt1: remote: build failed
2025-Mar-24 13:49:35 :: [i586] #200 pciex.git 0.0.2-alt1: build FAILED
2025-Mar-24 13:49:35 :: [i586] requesting cancellation of task processing
[x86_64]                  from /usr/src/RPM/BUILD/pciex-0.0.2/src/ui/compat_cap_comp.cpp:7:
[x86_64] /usr/src/RPM/BUILD/pciex-0.0.2/src/ui/common_comp.h:20:20: error: 'ftxui::Element ui::PushPullButton::Render()' marked 'override', but does not override
[x86_64]    20 |     ftxui::Element Render() override;
[x86_64] --
[x86_64]                  from /usr/src/RPM/BUILD/pciex-0.0.2/src/ui/ext_cap_comp.cpp:4:
[x86_64] /usr/src/RPM/BUILD/pciex-0.0.2/src/ui/common_comp.h:20:20: error: 'ftxui::Element ui::PushPullButton::Render()' marked 'override', but does not override
[x86_64]    20 |     ftxui::Element Render() override;
[x86_64] --
[x86_64] In file included from /usr/src/RPM/BUILD/pciex-0.0.2/src/main.cpp:11:
[x86_64] /usr/src/RPM/BUILD/pciex-0.0.2/src/ui/screen.h:212:20: error: 'ftxui::Element ui::PCITopoUIComp::Render()' marked 'override', but does not override
[x86_64]   212 |     ftxui::Element Render() override final;
[x86_64] /usr/src/RPM/BUILD/pciex-0.0.2/src/ui/screen.h:212:20: error: 'ftxui::Element ui::PCITopoUIComp::Render()' marked 'final', but is not virtual
[x86_64] /usr/src/RPM/BUILD/pciex-0.0.2/src/ui/screen.h:275:20: error: 'ftxui::Element ui::ScrollableComp::Render()' marked 'override', but does not override
[x86_64]   275 |     ftxui::Element Render() override final;
[x86_64] /usr/src/RPM/BUILD/pciex-0.0.2/src/ui/screen.h:275:20: error: 'ftxui::Element ui::ScrollableComp::Render()' marked 'final', but is not virtual
[x86_64] /usr/src/RPM/BUILD/pciex-0.0.2/src/ui/screen.h:302:20: error: 'ftxui::Element ui::PCIRegsComponent::Render()' marked 'override', but does not override
[x86_64]   302 |     ftxui::Element Render() override;
[x86_64] /usr/src/RPM/BUILD/pciex-0.0.2/src/ui/screen.h:325:20: error: 'ftxui::Element ui::BorderedHoverComp::Render()' marked 'override', but does not override
[x86_64]   325 |     ftxui::Element Render() override final;
[x86_64] /usr/src/RPM/BUILD/pciex-0.0.2/src/ui/screen.h:325:20: error: 'ftxui::Element ui::BorderedHoverComp::Render()' marked 'final', but is not virtual
[x86_64] gmake[2]: *** [CMakeFiles/pciex.dir/build.make:135: CMakeFiles/pciex.dir/src/main.cpp.o] Error 1
[x86_64] --
[x86_64] In file included from /usr/src/RPM/BUILD/pciex-0.0.2/src/ui/screen.cpp:7:
[x86_64] /usr/src/RPM/BUILD/pciex-0.0.2/src/ui/screen.h:212:20: error: 'ftxui::Element ui::PCITopoUIComp::Render()' marked 'override', but does not override
[x86_64]   212 |     ftxui::Element Render() override final;
2025-Mar-24 13:49:36 :: [x86_64] pciex.git 0.0.2-alt1: remote: build failed
2025-Mar-24 13:49:36 :: [x86_64] #200 pciex.git 0.0.2-alt1: build FAILED
[aarch64]                  from /usr/src/RPM/BUILD/pciex-0.0.2/src/ui/ext_cap_comp.cpp:4:
[aarch64] /usr/src/RPM/BUILD/pciex-0.0.2/src/ui/common_comp.h:20:20: error: 'ftxui::Element ui::PushPullButton::Render()' marked 'override', but does not override
[aarch64]    20 |     ftxui::Element Render() override;
[aarch64] --
[aarch64]                  from /usr/src/RPM/BUILD/pciex-0.0.2/src/ui/compat_cap_comp.cpp:7:
[aarch64] /usr/src/RPM/BUILD/pciex-0.0.2/src/ui/common_comp.h:20:20: error: 'ftxui::Element ui::PushPullButton::Render()' marked 'override', but does not override
[aarch64]    20 |     ftxui::Element Render() override;
[aarch64] --
[aarch64] In file included from /usr/src/RPM/BUILD/pciex-0.0.2/src/main.cpp:11:
[aarch64] /usr/src/RPM/BUILD/pciex-0.0.2/src/ui/screen.h:212:20: error: 'ftxui::Element ui::PCITopoUIComp::Render()' marked 'override', but does not override
[aarch64]   212 |     ftxui::Element Render() override final;
[aarch64] /usr/src/RPM/BUILD/pciex-0.0.2/src/ui/screen.h:212:20: error: 'ftxui::Element ui::PCITopoUIComp::Render()' marked 'final', but is not virtual
[aarch64] /usr/src/RPM/BUILD/pciex-0.0.2/src/ui/screen.h:275:20: error: 'ftxui::Element ui::ScrollableComp::Render()' marked 'override', but does not override
[aarch64]   275 |     ftxui::Element Render() override final;
[aarch64] /usr/src/RPM/BUILD/pciex-0.0.2/src/ui/screen.h:275:20: error: 'ftxui::Element ui::ScrollableComp::Render()' marked 'final', but is not virtual
[aarch64] /usr/src/RPM/BUILD/pciex-0.0.2/src/ui/screen.h:302:20: error: 'ftxui::Element ui::PCIRegsComponent::Render()' marked 'override', but does not override
[aarch64]   302 |     ftxui::Element Render() override;
[aarch64] /usr/src/RPM/BUILD/pciex-0.0.2/src/ui/screen.h:325:20: error: 'ftxui::Element ui::BorderedHoverComp::Render()' marked 'override', but does not override
[aarch64]   325 |     ftxui::Element Render() override final;
[aarch64] /usr/src/RPM/BUILD/pciex-0.0.2/src/ui/screen.h:325:20: error: 'ftxui::Element ui::BorderedHoverComp::Render()' marked 'final', but is not virtual
[aarch64] gmake[2]: *** [CMakeFiles/pciex.dir/build.make:135: CMakeFiles/pciex.dir/src/main.cpp.o] Error 1
[aarch64] --
[aarch64] In file included from /usr/src/RPM/BUILD/pciex-0.0.2/src/ui/common_comp.cpp:7:
[aarch64] /usr/src/RPM/BUILD/pciex-0.0.2/src/ui/common_comp.h:20:20: error: 'ftxui::Element ui::PushPullButton::Render()' marked 'override', but does not override
[aarch64]    20 |     ftxui::Element Render() override;
2025-Mar-24 13:50:21 :: [aarch64] pciex.git 0.0.2-alt1: remote: build failed
2025-Mar-24 13:50:21 :: [aarch64] #200 pciex.git 0.0.2-alt1: build FAILED
2025-Mar-24 13:49:35 :: [i586] build FAILED
2025-Mar-24 13:49:36 :: [x86_64] build FAILED
2025-Mar-24 13:50:21 :: [aarch64] build FAILED
2025-Mar-24 13:50:21 :: task #379109 for sisyphus FAILED


More information about the Sisyphus-incominger mailing list