[#375460] [test-only] p10 FAILED (try 14) python3-module-strict-rfc3339.git=0.7-alt1 ...
Girar awaiter (toni)
girar-builder at altlinux.org
Fri Mar 21 12:32:57 MSK 2025
https://git.altlinux.org/tasks/375460/logs/events.14.1.log
https://packages.altlinux.org/tasks/375460
subtask name aarch64 armh i586 x86_64
#2000 python3-module-jupyter-events ? ? failed failed
2025-Mar-21 09:30:30 :: test-only task #375460 for p10 resumed by toni:
#100 removed
#200 removed
#240 build 0.7-alt1 from /gears/p/python3-module-strict-rfc3339.git fetched at 2025-Feb-20 14:38:19 from sisyphus
#300 build 0.1.4-alt1 from /gears/p/python3-module-rfc3339-validator.git fetched at 2025-Feb-20 12:11:02 from sisyphus
#400 removed
#500 build 1.4.1-alt0.p10.1 from /people/toni/packages/python3-module-pytest-console-scripts.git fetched at 2025-Feb-21 14:07:30
#540 removed
#560 build 2.0.7-alt2 from /gears/p/python3-module-python-json-logger.git fetched at 2025-Mar-17 09:39:15 from p11
#600 removed
#700 removed
#1000 build 0.12.1-alt0.p10.1 from /people/toni/packages/python3-module-pytest-subtests.git fetched at 2025-Mar-17 15:48:55
#1100 build 0.18.1-alt1 from /gears/p/python3-module-rpds-py.git fetched at 2025-Mar-17 15:50:25 from p11
#1200 removed
#1300 build 23.2.0-alt1 from /gears/p/python3-module-attrs.git fetched at 2025-Mar-17 18:53:21 from p11
#1400 build 0.35.1-alt1 from /gears/p/python3-module-referencing.git fetched at 2025-Mar-17 18:56:59 from p11
#1500 build 2024.10.1-alt2 from /gears/p/python3-module-jsonschema-specifications.git fetched at 2025-Mar-19 11:28:41 from p11
#1600 build 4.22.0-alt1 from /gears/p/python3-module-jsonschema.git fetched at 2025-Mar-19 11:29:05 from p11
#1700 removed
#2000 build 0.10.0-alt0.p10.1 from /people/toni/packages/python3-module-jupyter-events.git fetched at 2025-Mar-21 09:30:00
2025-Mar-21 09:30:30 :: created build repo
2025-Mar-21 09:30:31 :: [i586] #240 python3-module-strict-rfc3339.git 0.7-alt1: build start
2025-Mar-21 09:30:31 :: [armh] #240 python3-module-strict-rfc3339.git 0.7-alt1: build start
2025-Mar-21 09:30:31 :: [aarch64] #240 python3-module-strict-rfc3339.git 0.7-alt1: build start
2025-Mar-21 09:30:31 :: [x86_64] #240 python3-module-strict-rfc3339.git 0.7-alt1: build start
2025-Mar-21 09:30:42 :: [i586] #240 python3-module-strict-rfc3339.git 0.7-alt1: build OK (cached)
2025-Mar-21 09:30:43 :: [i586] #300 python3-module-rfc3339-validator.git 0.1.4-alt1: build start
2025-Mar-21 09:30:43 :: [x86_64] #240 python3-module-strict-rfc3339.git 0.7-alt1: build OK (cached)
2025-Mar-21 09:30:43 :: [x86_64] #300 python3-module-rfc3339-validator.git 0.1.4-alt1: build start
2025-Mar-21 09:30:51 :: [aarch64] #240 python3-module-strict-rfc3339.git 0.7-alt1: build OK (cached)
2025-Mar-21 09:30:52 :: [aarch64] #300 python3-module-rfc3339-validator.git 0.1.4-alt1: build start
2025-Mar-21 09:30:54 :: [i586] #300 python3-module-rfc3339-validator.git 0.1.4-alt1: build OK (cached)
2025-Mar-21 09:30:54 :: [i586] #500 python3-module-pytest-console-scripts.git 1.4.1-alt0.p10.1: build start
2025-Mar-21 09:30:55 :: [x86_64] #300 python3-module-rfc3339-validator.git 0.1.4-alt1: build OK (cached)
2025-Mar-21 09:30:55 :: [x86_64] #500 python3-module-pytest-console-scripts.git 1.4.1-alt0.p10.1: build start
2025-Mar-21 09:31:00 :: [armh] #240 python3-module-strict-rfc3339.git 0.7-alt1: build OK (cached)
2025-Mar-21 09:31:00 :: [armh] #300 python3-module-rfc3339-validator.git 0.1.4-alt1: build start
2025-Mar-21 09:31:06 :: [i586] #500 python3-module-pytest-console-scripts.git 1.4.1-alt0.p10.1: build OK (cached)
2025-Mar-21 09:31:06 :: [i586] #560 python3-module-python-json-logger.git 2.0.7-alt2: build start
2025-Mar-21 09:31:06 :: [x86_64] #500 python3-module-pytest-console-scripts.git 1.4.1-alt0.p10.1: build OK (cached)
2025-Mar-21 09:31:07 :: [x86_64] #560 python3-module-python-json-logger.git 2.0.7-alt2: build start
2025-Mar-21 09:31:12 :: [aarch64] #300 python3-module-rfc3339-validator.git 0.1.4-alt1: build OK (cached)
2025-Mar-21 09:31:12 :: [aarch64] #500 python3-module-pytest-console-scripts.git 1.4.1-alt0.p10.1: build start
2025-Mar-21 09:31:17 :: [i586] #560 python3-module-python-json-logger.git 2.0.7-alt2: build OK (cached)
2025-Mar-21 09:31:17 :: [i586] #1000 python3-module-pytest-subtests.git 0.12.1-alt0.p10.1: build start
2025-Mar-21 09:31:18 :: [x86_64] #560 python3-module-python-json-logger.git 2.0.7-alt2: build OK (cached)
2025-Mar-21 09:31:18 :: [x86_64] #1000 python3-module-pytest-subtests.git 0.12.1-alt0.p10.1: build start
2025-Mar-21 09:31:28 :: [i586] #1000 python3-module-pytest-subtests.git 0.12.1-alt0.p10.1: build OK (cached)
2025-Mar-21 09:31:29 :: [i586] #1100 python3-module-rpds-py.git 0.18.1-alt1: build start
2025-Mar-21 09:31:29 :: [armh] #300 python3-module-rfc3339-validator.git 0.1.4-alt1: build OK (cached)
2025-Mar-21 09:31:29 :: [armh] #500 python3-module-pytest-console-scripts.git 1.4.1-alt0.p10.1: build start
2025-Mar-21 09:31:29 :: [x86_64] #1000 python3-module-pytest-subtests.git 0.12.1-alt0.p10.1: build OK (cached)
2025-Mar-21 09:31:30 :: [x86_64] #1100 python3-module-rpds-py.git 0.18.1-alt1: build start
2025-Mar-21 09:31:32 :: [aarch64] #500 python3-module-pytest-console-scripts.git 1.4.1-alt0.p10.1: build OK (cached)
2025-Mar-21 09:31:32 :: [aarch64] #560 python3-module-python-json-logger.git 2.0.7-alt2: build start
2025-Mar-21 09:31:40 :: [i586] #1100 python3-module-rpds-py.git 0.18.1-alt1: build OK (cached)
2025-Mar-21 09:31:40 :: [i586] #1300 python3-module-attrs.git 23.2.0-alt1: build start
2025-Mar-21 09:31:41 :: [x86_64] #1100 python3-module-rpds-py.git 0.18.1-alt1: build OK (cached)
2025-Mar-21 09:31:42 :: [x86_64] #1300 python3-module-attrs.git 23.2.0-alt1: build start
2025-Mar-21 09:31:52 :: [i586] #1300 python3-module-attrs.git 23.2.0-alt1: build OK (cached)
2025-Mar-21 09:31:52 :: [aarch64] #560 python3-module-python-json-logger.git 2.0.7-alt2: build OK (cached)
2025-Mar-21 09:31:52 :: [i586] #1400 python3-module-referencing.git 0.35.1-alt1: build start
2025-Mar-21 09:31:52 :: [aarch64] #1000 python3-module-pytest-subtests.git 0.12.1-alt0.p10.1: build start
2025-Mar-21 09:31:53 :: [x86_64] #1300 python3-module-attrs.git 23.2.0-alt1: build OK (cached)
2025-Mar-21 09:31:54 :: [x86_64] #1400 python3-module-referencing.git 0.35.1-alt1: build start
2025-Mar-21 09:31:58 :: [armh] #500 python3-module-pytest-console-scripts.git 1.4.1-alt0.p10.1: build OK (cached)
2025-Mar-21 09:31:59 :: [armh] #560 python3-module-python-json-logger.git 2.0.7-alt2: build start
2025-Mar-21 09:32:03 :: [i586] #1400 python3-module-referencing.git 0.35.1-alt1: build OK (cached)
2025-Mar-21 09:32:04 :: [i586] #1500 python3-module-jsonschema-specifications.git 2024.10.1-alt2: build start
2025-Mar-21 09:32:05 :: [x86_64] #1400 python3-module-referencing.git 0.35.1-alt1: build OK (cached)
2025-Mar-21 09:32:05 :: [x86_64] #1500 python3-module-jsonschema-specifications.git 2024.10.1-alt2: build start
2025-Mar-21 09:32:12 :: [aarch64] #1000 python3-module-pytest-subtests.git 0.12.1-alt0.p10.1: build OK (cached)
2025-Mar-21 09:32:12 :: [aarch64] #1100 python3-module-rpds-py.git 0.18.1-alt1: build start
2025-Mar-21 09:32:15 :: [i586] #1500 python3-module-jsonschema-specifications.git 2024.10.1-alt2: build OK (cached)
2025-Mar-21 09:32:15 :: [i586] #1600 python3-module-jsonschema.git 4.22.0-alt1: build start
2025-Mar-21 09:32:17 :: [x86_64] #1500 python3-module-jsonschema-specifications.git 2024.10.1-alt2: build OK (cached)
2025-Mar-21 09:32:17 :: [x86_64] #1600 python3-module-jsonschema.git 4.22.0-alt1: build start
2025-Mar-21 09:32:26 :: [i586] #1600 python3-module-jsonschema.git 4.22.0-alt1: build OK (cached)
2025-Mar-21 09:32:26 :: [i586] #2000 python3-module-jupyter-events.git 0.10.0-alt0.p10.1: build start
2025-Mar-21 09:32:27 :: [armh] #560 python3-module-python-json-logger.git 2.0.7-alt2: build OK (cached)
2025-Mar-21 09:32:27 :: [armh] #1000 python3-module-pytest-subtests.git 0.12.1-alt0.p10.1: build start
2025-Mar-21 09:32:29 :: [x86_64] #1600 python3-module-jsonschema.git 4.22.0-alt1: build OK (cached)
2025-Mar-21 09:32:29 :: [x86_64] #2000 python3-module-jupyter-events.git 0.10.0-alt0.p10.1: build start
2025-Mar-21 09:32:33 :: [aarch64] #1100 python3-module-rpds-py.git 0.18.1-alt1: build OK (cached)
2025-Mar-21 09:32:33 :: [aarch64] #1300 python3-module-attrs.git 23.2.0-alt1: build start
[i586] tests/test_logger.py::test_register_duplicate_schemas PASSED [ 52%]
[i586] tests/test_logger.py::test_noop_emit FAILED [ 55%]
[i586] tests/test_modifiers.py::test_modifier_function PASSED [ 57%]
[i586] --
[i586] =========================== short test summary info ============================
[i586] FAILED tests/test_logger.py::test_noop_emit - pytest.PytestUnhandledCoroutine...
[i586] ================== 1 failed, 39 passed, 3 deselected in 1.50s ==================
[i586] INFO : Command's result: FAILURE
[i586] INFO : Command's error: Command '['python3', '-m', 'pytest', '-v', '-k', 'not test_bad_validations', '--ignore', 'tests/test_listeners.py']' returned non-zero exit status 1.
2025-Mar-21 09:32:48 :: [i586] python3-module-jupyter-events.git 0.10.0-alt0.p10.1: remote: build failed
2025-Mar-21 09:32:48 :: [i586] #2000 python3-module-jupyter-events.git 0.10.0-alt0.p10.1: build FAILED
2025-Mar-21 09:32:48 :: [i586] requesting cancellation of task processing
[x86_64] tests/test_logger.py::test_register_duplicate_schemas PASSED [ 52%]
[x86_64] tests/test_logger.py::test_noop_emit FAILED [ 55%]
[x86_64] tests/test_modifiers.py::test_modifier_function PASSED [ 57%]
[x86_64] --
[x86_64] =========================== short test summary info ============================
[x86_64] FAILED tests/test_logger.py::test_noop_emit - pytest.PytestUnhandledCoroutine...
[x86_64] ================== 1 failed, 39 passed, 3 deselected in 1.32s ==================
[x86_64] INFO : Command's result: FAILURE
[x86_64] INFO : Command's error: Command '['python3', '-m', 'pytest', '-v', '-k', 'not test_bad_validations', '--ignore', 'tests/test_listeners.py']' returned non-zero exit status 1.
2025-Mar-21 09:32:51 :: [x86_64] python3-module-jupyter-events.git 0.10.0-alt0.p10.1: remote: build failed
2025-Mar-21 09:32:51 :: [x86_64] #2000 python3-module-jupyter-events.git 0.10.0-alt0.p10.1: build FAILED
2025-Mar-21 09:32:55 :: [aarch64] #1300 python3-module-attrs.git 23.2.0-alt1: build OK (cached)
2025-Mar-21 09:32:55 :: [aarch64] task processing CANCELLED
2025-Mar-21 09:32:56 :: [armh] #1000 python3-module-pytest-subtests.git 0.12.1-alt0.p10.1: build OK (cached)
2025-Mar-21 09:32:56 :: [armh] task processing CANCELLED
2025-Mar-21 09:32:48 :: [i586] build FAILED
2025-Mar-21 09:32:51 :: [x86_64] build FAILED
2025-Mar-21 09:32:55 :: [aarch64] build FAILED
2025-Mar-21 09:32:56 :: [armh] build FAILED
2025-Mar-21 09:32:56 :: task #375460 for p10 FAILED
More information about the Sisyphus-incominger
mailing list