[#378739] [test-only] FAILED hashsum.git=4.0.4-alt1
Girar awaiter (paladindev)
girar-builder at altlinux.org
Fri Mar 21 09:20:45 MSK 2025
https://git.altlinux.org/tasks/378739/logs/events.1.1.log
https://packages.altlinux.org/tasks/378739
subtask name aarch64 i586 x86_64
#100 hashsum failed failed failed
2025-Mar-21 06:19:55 :: test-only task #378739 for sisyphus started by paladindev:
#100 build 4.0.4-alt1 from /people/paladindev/packages/hashsum.git fetched at 2025-Mar-21 06:19:48
2025-Mar-21 06:19:57 :: [aarch64] #100 hashsum.git 4.0.4-alt1: build start
2025-Mar-21 06:19:57 :: [i586] #100 hashsum.git 4.0.4-alt1: build start
2025-Mar-21 06:19:57 :: [x86_64] #100 hashsum.git 4.0.4-alt1: build start
[x86_64] /usr/src/in/srpm/hashsum-4.0.4-alt1.src.rpm: wrong CHANGELOGNAME: expected "4.0.4-alt1", found "4.0.3-alt1"
[x86_64] sisyphus_check: check-changelog ERROR: changelog format violation
[x86_64] hsh-rebuild: hashsum-4.0.4-alt1.src.rpm: sisyphus_check failed.
2025-Mar-21 06:20:29 :: [x86_64] hashsum.git 4.0.4-alt1: remote: build failed
2025-Mar-21 06:20:29 :: [x86_64] #100 hashsum.git 4.0.4-alt1: build FAILED
2025-Mar-21 06:20:29 :: [x86_64] requesting cancellation of task processing
[i586] /usr/src/in/srpm/hashsum-4.0.4-alt1.src.rpm: wrong CHANGELOGNAME: expected "4.0.4-alt1", found "4.0.3-alt1"
[i586] sisyphus_check: check-changelog ERROR: changelog format violation
[i586] hsh-rebuild: hashsum-4.0.4-alt1.src.rpm: sisyphus_check failed.
2025-Mar-21 06:20:31 :: [i586] hashsum.git 4.0.4-alt1: remote: build failed
2025-Mar-21 06:20:31 :: [i586] #100 hashsum.git 4.0.4-alt1: build FAILED
[aarch64] /usr/src/in/srpm/hashsum-4.0.4-alt1.src.rpm: wrong CHANGELOGNAME: expected "4.0.4-alt1", found "4.0.3-alt1"
[aarch64] sisyphus_check: check-changelog ERROR: changelog format violation
[aarch64] hsh-rebuild: hashsum-4.0.4-alt1.src.rpm: sisyphus_check failed.
2025-Mar-21 06:20:44 :: [aarch64] hashsum.git 4.0.4-alt1: remote: build failed
2025-Mar-21 06:20:44 :: [aarch64] #100 hashsum.git 4.0.4-alt1: build FAILED
2025-Mar-21 06:20:29 :: [x86_64] build FAILED
2025-Mar-21 06:20:31 :: [i586] build FAILED
2025-Mar-21 06:20:45 :: [aarch64] build FAILED
2025-Mar-21 06:20:45 :: task #378739 for sisyphus FAILED
More information about the Sisyphus-incominger
mailing list