[#378657] FAILED foldy.git=3.7-alt1
Girar awaiter (rirusha)
girar-builder at altlinux.org
Thu Mar 20 12:28:24 MSK 2025
https://git.altlinux.org/tasks/378657/logs/events.1.1.log
https://packages.altlinux.org/tasks/378657
subtask name aarch64 i586 x86_64
#100 foldy failed failed failed
2025-Mar-20 09:27:23 :: task #378657 for sisyphus started by rirusha:
#100 build 3.7-alt1 from /people/rirusha/packages/foldy.git fetched at 2025-Mar-20 09:26:27
2025-Mar-20 09:27:25 :: [x86_64] #100 foldy.git 3.7-alt1: build start
2025-Mar-20 09:27:25 :: [aarch64] #100 foldy.git 3.7-alt1: build start
2025-Mar-20 09:27:25 :: [i586] #100 foldy.git 3.7-alt1: build start
[x86_64] [16/42] Compiling C object service/org.altlinux.FoldyService.p/meson-generated_main.c.o
[x86_64] FAILED: service/org.altlinux.FoldyService.p/meson-generated_main.c.o
[x86_64] cc -Iservice/org.altlinux.FoldyService.p -Iservice -I../service -Ilib -I../lib -I/usr/include/gio-unix-2.0 -I/usr/include/glib-2.0 -I/usr/lib64/glib-2.0/include -I/usr/include/gee-0.8 -fdiagnostics-color=always -D_FILE_OFFSET_BITS=64 -Wall -Winvalid-pch -O2 -g -Wno-int-conversion -pipe -frecord-gcc-switches -Wall -g -O2 -flto=auto -pthread -MD -MQ service/org.altlinux.FoldyService.p/meson-generated_main.c.o -MF service/org.altlinux.FoldyService.p/meson-generated_main.c.o.d -o service/org.altlinux.FoldyService.p/meson-generated_main.c.o -c service/org.altlinux.FoldyService.p/main.c
[x86_64] In file included from service/org.altlinux.FoldyService.p/main.c:28:
[x86_64] /usr/include/glib-2.0/glib/gi18n-lib.h:29:2: error: #error You must define GETTEXT_PACKAGE before including gi18n-lib.h. Did you forget to include config.h?
[x86_64] 29 | #error You must define GETTEXT_PACKAGE before including gi18n-lib.h. Did you forget to include config.h?
[x86_64] ../service/main.vala: In function â__lambda14_â:
[x86_64] /usr/include/glib-2.0/glib/gi18n-lib.h:32:42: error: âGETTEXT_PACKAGEâ undeclared (first use in this function)
[x86_64] 32 | #define _(String) ((char *) g_dgettext (GETTEXT_PACKAGE, String))
2025-Mar-20 09:28:04 :: [x86_64] foldy.git 3.7-alt1: remote: build failed
2025-Mar-20 09:28:04 :: [x86_64] #100 foldy.git 3.7-alt1: build FAILED
2025-Mar-20 09:28:04 :: [x86_64] requesting cancellation of task processing
[i586] [16/42] Compiling C object service/org.altlinux.FoldyService.p/meson-generated_main.c.o
[i586] FAILED: service/org.altlinux.FoldyService.p/meson-generated_main.c.o
[i586] cc -Iservice/org.altlinux.FoldyService.p -Iservice -I../service -Ilib -I../lib -I/usr/include/gio-unix-2.0 -I/usr/include/glib-2.0 -I/usr/lib/glib-2.0/include -I/usr/include/gee-0.8 -fdiagnostics-color=always -D_FILE_OFFSET_BITS=64 -Wall -Winvalid-pch -O2 -g -Wno-int-conversion -pipe -frecord-gcc-switches -Wall -g -O2 -flto=auto -march=i586 -mtune=generic -pthread -MD -MQ service/org.altlinux.FoldyService.p/meson-generated_main.c.o -MF service/org.altlinux.FoldyService.p/meson-generated_main.c.o.d -o service/org.altlinux.FoldyService.p/meson-generated_main.c.o -c service/org.altlinux.FoldyService.p/main.c
[i586] In file included from service/org.altlinux.FoldyService.p/main.c:28:
[i586] /usr/include/glib-2.0/glib/gi18n-lib.h:29:2: error: #error You must define GETTEXT_PACKAGE before including gi18n-lib.h. Did you forget to include config.h?
[i586] 29 | #error You must define GETTEXT_PACKAGE before including gi18n-lib.h. Did you forget to include config.h?
[i586] ../service/main.vala: In function â__lambda14_â:
[i586] /usr/include/glib-2.0/glib/gi18n-lib.h:32:42: error: âGETTEXT_PACKAGEâ undeclared (first use in this function)
[i586] 32 | #define _(String) ((char *) g_dgettext (GETTEXT_PACKAGE, String))
2025-Mar-20 09:28:07 :: [i586] foldy.git 3.7-alt1: remote: build failed
2025-Mar-20 09:28:07 :: [i586] #100 foldy.git 3.7-alt1: build FAILED
[aarch64] [16/42] Compiling C object service/org.altlinux.FoldyService.p/meson-generated_main.c.o
[aarch64] FAILED: service/org.altlinux.FoldyService.p/meson-generated_main.c.o
[aarch64] cc -Iservice/org.altlinux.FoldyService.p -Iservice -I../service -Ilib -I../lib -I/usr/include/gio-unix-2.0 -I/usr/include/glib-2.0 -I/usr/lib64/glib-2.0/include -I/usr/include/gee-0.8 -fdiagnostics-color=always -D_FILE_OFFSET_BITS=64 -Wall -Winvalid-pch -O2 -g -Wno-int-conversion -pipe -frecord-gcc-switches -Wall -g -O2 -flto=auto -pthread -MD -MQ service/org.altlinux.FoldyService.p/meson-generated_main.c.o -MF service/org.altlinux.FoldyService.p/meson-generated_main.c.o.d -o service/org.altlinux.FoldyService.p/meson-generated_main.c.o -c service/org.altlinux.FoldyService.p/main.c
[aarch64] In file included from service/org.altlinux.FoldyService.p/main.c:28:
[aarch64] /usr/include/glib-2.0/glib/gi18n-lib.h:29:2: error: #error You must define GETTEXT_PACKAGE before including gi18n-lib.h. Did you forget to include config.h?
[aarch64] 29 | #error You must define GETTEXT_PACKAGE before including gi18n-lib.h. Did you forget to include config.h?
[aarch64] ../service/main.vala: In function â__lambda14_â:
[aarch64] /usr/include/glib-2.0/glib/gi18n-lib.h:32:42: error: âGETTEXT_PACKAGEâ undeclared (first use in this function)
[aarch64] 32 | #define _(String) ((char *) g_dgettext (GETTEXT_PACKAGE, String))
2025-Mar-20 09:28:24 :: [aarch64] foldy.git 3.7-alt1: remote: build failed
2025-Mar-20 09:28:24 :: [aarch64] #100 foldy.git 3.7-alt1: build FAILED
2025-Mar-20 09:28:04 :: [x86_64] build FAILED
2025-Mar-20 09:28:07 :: [i586] build FAILED
2025-Mar-20 09:28:24 :: [aarch64] build FAILED
2025-Mar-20 09:28:24 :: task #378657 for sisyphus FAILED
More information about the Sisyphus-incominger
mailing list