[#378500] [test-only] p11 FAILED (try 3) proxmox-backup.git=3.3.3.1-alt3 make-initrd-pbs.git=1.0.6-alt1 ...
Girar awaiter (darisishe)
girar-builder at altlinux.org
Wed Mar 19 22:25:13 MSK 2025
https://git.altlinux.org/tasks/378500/logs/events.3.1.log
https://packages.altlinux.org/tasks/378500
subtask name aarch64 i586 x86_64
#240 make-initrd-pbs 27 - 17
#440 rpm-build-initrd-pbs ? - failed
2025-Mar-19 19:23:22 :: test-only task #378500 for p11 resumed by darisishe:
#100 build 3.3.3.1-alt3 from /people/darisishe/packages/proxmox-backup.git fetched at 2025-Mar-19 03:41:59
#200 removed
#240 build 1.0.6-alt1 from /people/darisishe/packages/make-initrd-pbs.git fetched at 2025-Mar-19 19:22:26
#300 removed
#400 removed
#440 build 0.1-alt1 from /people/darisishe/packages/rpm-build-initrd-pbs.git fetched at 2025-Mar-19 19:23:10
#500 build 3.3.3.1-alt1 from /people/darisishe/packages/proxmox-backup-restore-image.git fetched at 2025-Mar-19 03:56:18
2025-Mar-19 19:23:22 :: waiting for a shared lock on p11
2025-Mar-19 19:24:06 :: acquired a shared lock on p11
2025-Mar-19 19:24:07 :: created build repo
2025-Mar-19 19:24:08 :: #500: force rebuild
2025-Mar-19 19:24:08 :: [i586] #100 proxmox-backup.git 3.3.3.1-alt3: build start
2025-Mar-19 19:24:08 :: [aarch64] #100 proxmox-backup.git 3.3.3.1-alt3: build start
2025-Mar-19 19:24:08 :: [x86_64] #100 proxmox-backup.git 3.3.3.1-alt3: build start
2025-Mar-19 19:24:27 :: [i586] #100 proxmox-backup.git 3.3.3.1-alt3: build SKIPPED
2025-Mar-19 19:24:27 :: [x86_64] #100 proxmox-backup.git 3.3.3.1-alt3: build OK (cached)
2025-Mar-19 19:24:28 :: [i586] #240 make-initrd-pbs.git 1.0.6-alt1: build start
2025-Mar-19 19:24:28 :: [x86_64] #240 make-initrd-pbs.git 1.0.6-alt1: build start
2025-Mar-19 19:24:39 :: [i586] #240 make-initrd-pbs.git 1.0.6-alt1: build SKIPPED
2025-Mar-19 19:24:39 :: [i586] #440 rpm-build-initrd-pbs.git 0.1-alt1: build start
2025-Mar-19 19:24:45 :: [aarch64] #100 proxmox-backup.git 3.3.3.1-alt3: build OK (cached)
2025-Mar-19 19:24:45 :: [aarch64] #240 make-initrd-pbs.git 1.0.6-alt1: build start
2025-Mar-19 19:24:45 :: [x86_64] #240 make-initrd-pbs.git 1.0.6-alt1: build OK
2025-Mar-19 19:24:45 :: [x86_64] #440 rpm-build-initrd-pbs.git 0.1-alt1: build start
2025-Mar-19 19:24:51 :: [i586] #440 rpm-build-initrd-pbs.git 0.1-alt1: build SKIPPED
2025-Mar-19 19:24:51 :: [i586] #500 proxmox-backup-restore-image.git 3.3.3.1-alt1: build start
[x86_64] /.out/rpm-build-initrd-pbs-0.1-alt1.x86_64.rpm: forbidden dependencies: kernel-image-6.12 kernel-modules-zfs-6.12
[x86_64] sisyphus_check: check-deps ERROR: package dependencies violation
[x86_64] /.out/rpm-build-initrd-pbs-0.1-alt1.x86_64.rpm: The use of such a license name is ambiguous: GPL
[x86_64] hsh-rebuild: rpm-build-initrd-pbs-0.1-alt1.src.rpm: sisyphus_check failed.
2025-Mar-19 19:25:02 :: [x86_64] rpm-build-initrd-pbs.git 0.1-alt1: remote: build failed
2025-Mar-19 19:25:02 :: [x86_64] #440 rpm-build-initrd-pbs.git 0.1-alt1: build FAILED
2025-Mar-19 19:25:02 :: [x86_64] requesting cancellation of task processing
2025-Mar-19 19:25:02 :: [i586] #500 proxmox-backup-restore-image.git 3.3.3.1-alt1: build SKIPPED
2025-Mar-19 19:25:12 :: [aarch64] #240 make-initrd-pbs.git 1.0.6-alt1: build OK
2025-Mar-19 19:25:12 :: [aarch64] task processing CANCELLED
2025-Mar-19 19:25:02 :: [x86_64] build FAILED
2025-Mar-19 19:25:13 :: [aarch64] build FAILED
2025-Mar-19 19:25:13 :: task #378500 for p11 FAILED
More information about the Sisyphus-incominger
mailing list