[#378460] [test-only] FAILED (try 9) tcc.git=0.9.27-alt5.1213.gf075851f

Girar awaiter (x1z53) girar-builder at altlinux.org
Tue Mar 18 22:24:51 MSK 2025


https://git.altlinux.org/tasks/378460/logs/events.9.1.log
https://packages.altlinux.org/tasks/378460

subtask  name  aarch64  i586  x86_64
  #1000  tcc    failed  1:03    1:03

2025-Mar-18 19:23:47 :: test-only task #378460 for sisyphus resumed by x1z53:
#100 removed
#200 removed
#300 removed
#400 removed
#500 removed
#600 removed
#700 removed
#1000 build 0.9.27-alt5.1213.gf075851f from /people/x1z53/packages/tcc.git fetched at 2025-Mar-18 19:23:39
2025-Mar-18 19:23:48 :: [aarch64] #1000 tcc.git 0.9.27-alt5.1213.gf075851f: build start
2025-Mar-18 19:23:48 :: [i586] #1000 tcc.git 0.9.27-alt5.1213.gf075851f: build start
2025-Mar-18 19:23:48 :: [x86_64] #1000 tcc.git 0.9.27-alt5.1213.gf075851f: build start
[aarch64] ------------ dlltest ------------
[aarch64] tcc: error: library 'm' not found
[aarch64] make[2]: *** [Makefile:164: dlltest] Error 1
2025-Mar-18 19:24:44 :: [aarch64] tcc.git 0.9.27-alt5.1213.gf075851f: remote: build failed
2025-Mar-18 19:24:44 :: [aarch64] #1000 tcc.git 0.9.27-alt5.1213.gf075851f: build FAILED
2025-Mar-18 19:24:44 :: [aarch64] requesting cancellation of task processing
2025-Mar-18 19:24:51 :: [i586] #1000 tcc.git 0.9.27-alt5.1213.gf075851f: build OK
2025-Mar-18 19:24:51 :: [x86_64] #1000 tcc.git 0.9.27-alt5.1213.gf075851f: build OK
2025-Mar-18 19:24:44 :: [aarch64] build FAILED
2025-Mar-18 19:24:51 :: task #378460 for sisyphus FAILED


More information about the Sisyphus-incominger mailing list