[#378460] [test-only] FAILED tcc.git=0.9.27-alt5.1213.gf075851f

Girar awaiter (x1z53) girar-builder at altlinux.org
Tue Mar 18 19:45:14 MSK 2025


https://git.altlinux.org/tasks/378460/logs/events.1.1.log
https://packages.altlinux.org/tasks/378460

subtask  name  aarch64    i586  x86_64
   #100  tcc    failed  failed  failed

2025-Mar-18 16:44:57 :: test-only task #378460 for sisyphus started by x1z53:
#100 build 0.9.27-alt5.1213.gf075851f from /people/x1z53/packages/tcc.git fetched at 2025-Mar-18 16:36:09
2025-Mar-18 16:44:58 :: [aarch64] #100 tcc.git 0.9.27-alt5.1213.gf075851f: build start
2025-Mar-18 16:44:58 :: [i586] #100 tcc.git 0.9.27-alt5.1213.gf075851f: build start
2025-Mar-18 16:44:58 :: [x86_64] #100 tcc.git 0.9.27-alt5.1213.gf075851f: build start
[i586] error: Duplicate Url entries in package: (main package)
[i586] hsh-rebuild: pkg.tar: failed to fetch build dependencies.
2025-Mar-18 16:45:08 :: [i586] tcc.git 0.9.27-alt5.1213.gf075851f: remote: cannot build src.rpm
2025-Mar-18 16:45:08 :: [i586] #100 tcc.git 0.9.27-alt5.1213.gf075851f: build FAILED
2025-Mar-18 16:45:08 :: [i586] requesting cancellation of task processing
[x86_64] error: Duplicate Url entries in package: (main package)
[x86_64] hsh-rebuild: pkg.tar: failed to fetch build dependencies.
2025-Mar-18 16:45:08 :: [x86_64] tcc.git 0.9.27-alt5.1213.gf075851f: remote: cannot build src.rpm
2025-Mar-18 16:45:08 :: [x86_64] #100 tcc.git 0.9.27-alt5.1213.gf075851f: build FAILED
[aarch64] error: Duplicate Url entries in package: (main package)
[aarch64] hsh-rebuild: pkg.tar: failed to fetch build dependencies.
2025-Mar-18 16:45:14 :: [aarch64] tcc.git 0.9.27-alt5.1213.gf075851f: remote: cannot build src.rpm
2025-Mar-18 16:45:14 :: [aarch64] #100 tcc.git 0.9.27-alt5.1213.gf075851f: build FAILED
2025-Mar-18 16:45:08 :: [i586] build FAILED
2025-Mar-18 16:45:08 :: [x86_64] build FAILED
2025-Mar-18 16:45:14 :: [aarch64] build FAILED
2025-Mar-18 16:45:14 :: task #378460 for sisyphus FAILED


More information about the Sisyphus-incominger mailing list