[#378436] [test-only] p10 FAILED cmrc.git=2.0.1-alt1 libfmt.git=9.1.0-alt0.p10.1 vcpkg.git=2023.09.15-alt1 ...
Girar awaiter (alton)
girar-builder at altlinux.org
Tue Mar 18 17:29:26 MSK 2025
https://git.altlinux.org/tasks/378436/logs/events.1.1.log
https://packages.altlinux.org/tasks/378436
subtask name aarch64 armh i586 x86_64
#100 cmrc 47 1:09 31 28
#200 libfmt 2:30 4:32 1:35 1:18
#300 vcpkg ? ? failed failed
2025-Mar-18 14:23:42 :: test-only task #378436 for p10 started by alton:
2025-Mar-18 14:23:42 :: message: new_package
#100 build 2.0.1-alt1 from /gears/c/cmrc.git fetched at 2025-Mar-18 14:14:54 from p11
#200 build 9.1.0-alt0.p10.1 from /people/alton/packages/libfmt.git fetched at 2025-Mar-18 14:16:32
#300 build 2023.09.15-alt1 from /gears/v/vcpkg.git fetched at 2025-Mar-18 14:17:54 from p11
#400 build 1.3.7-alt0.p10.1 from /people/alton/packages/rustdesk.git fetched at 2025-Mar-18 14:22:14
2025-Mar-18 14:23:43 :: created build repo
2025-Mar-18 14:23:44 :: [x86_64] #100 cmrc.git 2.0.1-alt1: build start
2025-Mar-18 14:23:44 :: [aarch64] #100 cmrc.git 2.0.1-alt1: build start
2025-Mar-18 14:23:44 :: [i586] #100 cmrc.git 2.0.1-alt1: build start
2025-Mar-18 14:23:44 :: [armh] #100 cmrc.git 2.0.1-alt1: build start
2025-Mar-18 14:24:12 :: [x86_64] #100 cmrc.git 2.0.1-alt1: build OK
2025-Mar-18 14:24:12 :: [x86_64] #200 libfmt.git 9.1.0-alt0.p10.1: build start
2025-Mar-18 14:24:15 :: [i586] #100 cmrc.git 2.0.1-alt1: build OK
2025-Mar-18 14:24:15 :: [i586] #200 libfmt.git 9.1.0-alt0.p10.1: build start
2025-Mar-18 14:24:31 :: [aarch64] #100 cmrc.git 2.0.1-alt1: build OK
2025-Mar-18 14:24:31 :: [aarch64] #200 libfmt.git 9.1.0-alt0.p10.1: build start
2025-Mar-18 14:24:53 :: [armh] #100 cmrc.git 2.0.1-alt1: build OK
2025-Mar-18 14:24:53 :: [armh] #200 libfmt.git 9.1.0-alt0.p10.1: build start
2025-Mar-18 14:25:30 :: [x86_64] #200 libfmt.git 9.1.0-alt0.p10.1: build OK
2025-Mar-18 14:25:31 :: [x86_64] #300 vcpkg.git 2023.09.15-alt1: build start
2025-Mar-18 14:25:50 :: [i586] #200 libfmt.git 9.1.0-alt0.p10.1: build OK
2025-Mar-18 14:25:51 :: [i586] #300 vcpkg.git 2023.09.15-alt1: build start
[x86_64] /usr/src/RPM/BUILD/vcpkg-2023.09.15/include/vcpkg/base/fwd/format.h:39:45: error: qualified name does not name a class before ':' token
[x86_64] 39 | struct fmt::formatter<Type, Char, void> : fmt::formatter<vcpkg::StringLiteral, Char, void> \
[x86_64] --
[x86_64] 33 | VCPKG_FORMAT_WITH_TO_STRING_LITERAL_NONMEMBER(vcpkg::DeploymentKind);
[x86_64] /usr/src/RPM/BUILD/vcpkg-2023.09.15/include/vcpkg/base/fwd/format.h:39:45: error: expected '{' before ':' token
[x86_64] 39 | struct fmt::formatter<Type, Char, void> : fmt::formatter<vcpkg::StringLiteral, Char, void> \
[x86_64] --
[x86_64] 33 | VCPKG_FORMAT_WITH_TO_STRING_LITERAL_NONMEMBER(vcpkg::DeploymentKind);
[x86_64] /usr/src/RPM/BUILD/vcpkg-2023.09.15/include/vcpkg/base/fwd/format.h:28:17: error: 'formatter' is not a class template
[x86_64] 28 | struct fmt::formatter<Type, Char, void> : fmt::formatter<std::string, Char, void> \
[x86_64] --
[x86_64] 34 | VCPKG_FORMAT_WITH_TO_STRING(vcpkg::BundleSettings);
[x86_64] /usr/src/RPM/BUILD/vcpkg-2023.09.15/include/vcpkg/base/fwd/format.h:28:45: error: qualified name does not name a class before ':' token
[x86_64] 28 | struct fmt::formatter<Type, Char, void> : fmt::formatter<std::string, Char, void> \
[x86_64] --
[x86_64] 34 | VCPKG_FORMAT_WITH_TO_STRING(vcpkg::BundleSettings);
[x86_64] /usr/src/RPM/BUILD/vcpkg-2023.09.15/include/vcpkg/base/fwd/format.h:28:45: error: expected '{' before ':' token
[x86_64] 28 | struct fmt::formatter<Type, Char, void> : fmt::formatter<std::string, Char, void> \
[x86_64] --
[x86_64] 34 | VCPKG_FORMAT_WITH_TO_STRING(vcpkg::BundleSettings);
[x86_64] /usr/src/RPM/BUILD/vcpkg-2023.09.15/include/vcpkg/base/fwd/format.h:17:17: error: 'formatter' is not a class template
[x86_64] 17 | struct fmt::formatter<Type, Char, void> : fmt::formatter<Base, Char, void> \
[x86_64] --
[x86_64] 47 | VCPKG_FORMAT_AS(vcpkg::Triplet, vcpkg::StringView);
[x86_64] /usr/src/RPM/BUILD/vcpkg-2023.09.15/include/vcpkg/base/fwd/format.h:17:45: error: qualified name does not name a class before ':' token
[x86_64] 17 | struct fmt::formatter<Type, Char, void> : fmt::formatter<Base, Char, void> \
[x86_64] --
[x86_64] 47 | VCPKG_FORMAT_AS(vcpkg::Triplet, vcpkg::StringView);
[x86_64] /usr/src/RPM/BUILD/vcpkg-2023.09.15/include/vcpkg/base/fwd/format.h:17:45: error: expected '{' before ':' token
[x86_64] 17 | struct fmt::formatter<Type, Char, void> : fmt::formatter<Base, Char, void> \
[x86_64] --
[x86_64] 47 | VCPKG_FORMAT_AS(vcpkg::Triplet, vcpkg::StringView);
[x86_64] /usr/src/RPM/BUILD/vcpkg-2023.09.15/include/vcpkg/base/fwd/format.h:28:17: error: 'formatter' is not a class template
[x86_64] 28 | struct fmt::formatter<Type, Char, void> : fmt::formatter<std::string, Char, void> \
[x86_64] --
[x86_64] 176 | VCPKG_FORMAT_WITH_TO_STRING(vcpkg::PackageSpec);
[x86_64] /usr/src/RPM/BUILD/vcpkg-2023.09.15/include/vcpkg/base/fwd/format.h:28:45: error: qualified name does not name a class before ':' token
[x86_64] 28 | struct fmt::formatter<Type, Char, void> : fmt::formatter<std::string, Char, void> \
2025-Mar-18 14:25:54 :: [x86_64] vcpkg.git 2023.09.15-alt1: remote: build failed
2025-Mar-18 14:25:54 :: [x86_64] #300 vcpkg.git 2023.09.15-alt1: build FAILED
2025-Mar-18 14:25:54 :: [x86_64] requesting cancellation of task processing
[i586] /usr/src/RPM/BUILD/vcpkg-2023.09.15/include/vcpkg/base/fwd/format.h:39:45: error: qualified name does not name a class before ':' token
[i586] 39 | struct fmt::formatter<Type, Char, void> : fmt::formatter<vcpkg::StringLiteral, Char, void> \
[i586] --
[i586] 33 | VCPKG_FORMAT_WITH_TO_STRING_LITERAL_NONMEMBER(vcpkg::DeploymentKind);
[i586] /usr/src/RPM/BUILD/vcpkg-2023.09.15/include/vcpkg/base/fwd/format.h:39:45: error: expected '{' before ':' token
[i586] 39 | struct fmt::formatter<Type, Char, void> : fmt::formatter<vcpkg::StringLiteral, Char, void> \
[i586] --
[i586] 33 | VCPKG_FORMAT_WITH_TO_STRING_LITERAL_NONMEMBER(vcpkg::DeploymentKind);
[i586] /usr/src/RPM/BUILD/vcpkg-2023.09.15/include/vcpkg/base/fwd/format.h:28:17: error: 'formatter' is not a class template
[i586] 28 | struct fmt::formatter<Type, Char, void> : fmt::formatter<std::string, Char, void> \
[i586] --
[i586] 34 | VCPKG_FORMAT_WITH_TO_STRING(vcpkg::BundleSettings);
[i586] /usr/src/RPM/BUILD/vcpkg-2023.09.15/include/vcpkg/base/fwd/format.h:28:45: error: qualified name does not name a class before ':' token
[i586] 28 | struct fmt::formatter<Type, Char, void> : fmt::formatter<std::string, Char, void> \
[i586] --
[i586] 34 | VCPKG_FORMAT_WITH_TO_STRING(vcpkg::BundleSettings);
[i586] /usr/src/RPM/BUILD/vcpkg-2023.09.15/include/vcpkg/base/fwd/format.h:28:45: error: expected '{' before ':' token
[i586] 28 | struct fmt::formatter<Type, Char, void> : fmt::formatter<std::string, Char, void> \
[i586] --
[i586] 34 | VCPKG_FORMAT_WITH_TO_STRING(vcpkg::BundleSettings);
[i586] /usr/src/RPM/BUILD/vcpkg-2023.09.15/include/vcpkg/base/fwd/format.h:17:17: error: 'formatter' is not a class template
[i586] 17 | struct fmt::formatter<Type, Char, void> : fmt::formatter<Base, Char, void> \
[i586] --
[i586] 47 | VCPKG_FORMAT_AS(vcpkg::Triplet, vcpkg::StringView);
[i586] /usr/src/RPM/BUILD/vcpkg-2023.09.15/include/vcpkg/base/fwd/format.h:17:45: error: qualified name does not name a class before ':' token
[i586] 17 | struct fmt::formatter<Type, Char, void> : fmt::formatter<Base, Char, void> \
[i586] --
[i586] 47 | VCPKG_FORMAT_AS(vcpkg::Triplet, vcpkg::StringView);
[i586] /usr/src/RPM/BUILD/vcpkg-2023.09.15/include/vcpkg/base/fwd/format.h:17:45: error: expected '{' before ':' token
[i586] 17 | struct fmt::formatter<Type, Char, void> : fmt::formatter<Base, Char, void> \
[i586] --
[i586] 47 | VCPKG_FORMAT_AS(vcpkg::Triplet, vcpkg::StringView);
[i586] /usr/src/RPM/BUILD/vcpkg-2023.09.15/include/vcpkg/base/fwd/format.h:28:17: error: 'formatter' is not a class template
[i586] 28 | struct fmt::formatter<Type, Char, void> : fmt::formatter<std::string, Char, void> \
[i586] --
[i586] 176 | VCPKG_FORMAT_WITH_TO_STRING(vcpkg::PackageSpec);
[i586] /usr/src/RPM/BUILD/vcpkg-2023.09.15/include/vcpkg/base/fwd/format.h:28:45: error: qualified name does not name a class before ':' token
[i586] 28 | struct fmt::formatter<Type, Char, void> : fmt::formatter<std::string, Char, void> \
2025-Mar-18 14:26:15 :: [i586] vcpkg.git 2023.09.15-alt1: remote: build failed
2025-Mar-18 14:26:15 :: [i586] #300 vcpkg.git 2023.09.15-alt1: build FAILED
2025-Mar-18 14:27:01 :: [aarch64] #200 libfmt.git 9.1.0-alt0.p10.1: build OK
2025-Mar-18 14:27:01 :: [aarch64] task processing CANCELLED
2025-Mar-18 14:29:25 :: [armh] #200 libfmt.git 9.1.0-alt0.p10.1: build OK
2025-Mar-18 14:29:25 :: [armh] task processing CANCELLED
2025-Mar-18 14:25:54 :: [x86_64] build FAILED
2025-Mar-18 14:26:15 :: [i586] build FAILED
2025-Mar-18 14:27:01 :: [aarch64] build FAILED
2025-Mar-18 14:29:25 :: [armh] build FAILED
2025-Mar-18 14:29:25 :: task #378436 for p10 FAILED
More information about the Sisyphus-incominger
mailing list