[#378368] [test-only] FAILED taglib.git=2.0.2-alt2

Girar awaiter (zerg) girar-builder at altlinux.org
Tue Mar 18 10:56:28 MSK 2025


https://git.altlinux.org/tasks/378368/logs/events.1.1.log
https://packages.altlinux.org/tasks/378368

subtask  name    aarch64    i586  x86_64
   #100  taglib   failed  failed  failed

2025-Mar-18 07:55:16 :: test-only task #378368 for sisyphus started by zerg:
#100 build 2.0.2-alt2 from /people/zerg/packages/taglib.git fetched at 2025-Mar-18 07:55:15
2025-Mar-18 07:55:18 :: [aarch64] #100 taglib.git 2.0.2-alt2: build start
2025-Mar-18 07:55:18 :: [x86_64] #100 taglib.git 2.0.2-alt2: build start
2025-Mar-18 07:55:18 :: [i586] #100 taglib.git 2.0.2-alt2: build start
[x86_64] find-requires: running scripts (cpp,debuginfo,files,lib,pam,perl,pkgconfig,pkgconfiglib,python,python3,qml6,rpmlib,shebang,shell,static,symlinks,systemd-services)
[x86_64] Package taglib was not found in the pkg-config search path.
[x86_64] Perhaps you should add the directory containing `taglib.pc'
[x86_64] to the PKG_CONFIG_PATH environment variable
[x86_64] Package 'taglib', required by 'taglib_c-2', not found
[x86_64] cpp.req: ERROR: pkg-config failed
[x86_64] find-requires: ERROR: /usr/lib/rpm/cpp.req failed
[x86_64] error: /bin/sh failed
[x86_64] error: Failed to find Requires
[x86_64] RPM build errors:
2025-Mar-18 07:56:01 :: [x86_64] taglib.git 2.0.2-alt2: remote: build failed
2025-Mar-18 07:56:01 :: [x86_64] #100 taglib.git 2.0.2-alt2: build FAILED
2025-Mar-18 07:56:01 :: [x86_64] requesting cancellation of task processing
[i586] find-requires: running scripts (cpp,debuginfo,files,lib,pam,perl,pkgconfig,pkgconfiglib,python,python3,qml6,rpmlib,shebang,shell,static,symlinks,systemd-services)
[i586] Package taglib was not found in the pkg-config search path.
[i586] Perhaps you should add the directory containing `taglib.pc'
[i586] to the PKG_CONFIG_PATH environment variable
[i586] Package 'taglib', required by 'taglib_c-2', not found
[i586] cpp.req: ERROR: pkg-config failed
[i586] find-requires: ERROR: /usr/lib/rpm/cpp.req failed
[i586] error: /bin/sh failed
[i586] error: Failed to find Requires
[i586] RPM build errors:
2025-Mar-18 07:56:07 :: [i586] taglib.git 2.0.2-alt2: remote: build failed
2025-Mar-18 07:56:07 :: [i586] #100 taglib.git 2.0.2-alt2: build FAILED
[aarch64] find-requires: running scripts (cpp,debuginfo,files,lib,pam,perl,pkgconfig,pkgconfiglib,python,python3,qml6,rpmlib,shebang,shell,static,symlinks,systemd-services)
[aarch64] Package taglib was not found in the pkg-config search path.
[aarch64] Perhaps you should add the directory containing `taglib.pc'
[aarch64] to the PKG_CONFIG_PATH environment variable
[aarch64] Package 'taglib', required by 'taglib_c-2', not found
[aarch64] cpp.req: ERROR: pkg-config failed
[aarch64] find-requires: ERROR: /usr/lib/rpm/cpp.req failed
[aarch64] error: /bin/sh failed
[aarch64] error: Failed to find Requires
[aarch64] RPM build errors:
2025-Mar-18 07:56:28 :: [aarch64] taglib.git 2.0.2-alt2: remote: build failed
2025-Mar-18 07:56:28 :: [aarch64] #100 taglib.git 2.0.2-alt2: build FAILED
2025-Mar-18 07:56:01 :: [x86_64] build FAILED
2025-Mar-18 07:56:07 :: [i586] build FAILED
2025-Mar-18 07:56:28 :: [aarch64] build FAILED
2025-Mar-18 07:56:28 :: task #378368 for sisyphus FAILED


More information about the Sisyphus-incominger mailing list