[#378308] [test-only] FAILED portainer.git=2.27.1-alt1
Girar awaiter (lvol)
girar-builder at altlinux.org
Mon Mar 17 16:30:40 MSK 2025
https://git.altlinux.org/tasks/378308/logs/events.1.1.log
https://packages.altlinux.org/tasks/378308
subtask name aarch64 i586 x86_64
#100 portainer 1:32 failed 58
2025-Mar-17 13:29:06 :: test-only task #378308 for sisyphus started by lvol:
#100 build 2.27.1-alt1 from /people/lvol/packages/portainer.git fetched at 2025-Mar-17 13:29:03
2025-Mar-17 13:29:07 :: [i586] #100 portainer.git 2.27.1-alt1: build start
2025-Mar-17 13:29:07 :: [x86_64] #100 portainer.git 2.27.1-alt1: build start
2025-Mar-17 13:29:07 :: [aarch64] #100 portainer.git 2.27.1-alt1: build start
2025-Mar-17 13:30:05 :: [x86_64] #100 portainer.git 2.27.1-alt1: build OK
[i586] + install -Dm755 portainer/portainer /usr/src/tmp/portainer-buildroot/usr/bin/portainer
[i586] /bin/install: cannot stat 'portainer/portainer': No such file or directory
2025-Mar-17 13:30:12 :: [i586] portainer.git 2.27.1-alt1: remote: build failed
2025-Mar-17 13:30:12 :: [i586] #100 portainer.git 2.27.1-alt1: build FAILED
2025-Mar-17 13:30:12 :: [i586] requesting cancellation of task processing
2025-Mar-17 13:30:39 :: [aarch64] #100 portainer.git 2.27.1-alt1: build OK
2025-Mar-17 13:30:12 :: [i586] build FAILED
2025-Mar-17 13:30:40 :: task #378308 for sisyphus FAILED
More information about the Sisyphus-incominger
mailing list