[#374162] [test-only] FAILED (try 2) MySQL.git=8.4.4-alt1
Girar awaiter (nickel)
girar-builder at altlinux.org
Fri Mar 14 15:53:14 MSK 2025
https://git.altlinux.org/tasks/374162/logs/events.2.1.log
https://packages.altlinux.org/tasks/374162
subtask name aarch64 i586 x86_64
#100 MySQL failed failed 31:19
2025-Mar-14 12:21:52 :: test-only task #374162 for sisyphus resumed by nickel:
2025-Mar-14 12:21:52 :: message: test
#100 build 8.4.4-alt1 from /people/nickel/packages/MySQL.git fetched at 2025-Feb-10 04:28:07
2025-Mar-14 12:21:53 :: #100: force rebuild
2025-Mar-14 12:21:54 :: [x86_64] #100 MySQL.git 8.4.4-alt1: build start
2025-Mar-14 12:21:54 :: [i586] #100 MySQL.git 8.4.4-alt1: build start
2025-Mar-14 12:21:54 :: [aarch64] #100 MySQL.git 8.4.4-alt1: build start
[aarch64] warning: Macro %cmake not found
[aarch64] warning: Macro %cmake_build not found
[aarch64] warning: Macro %cmakeinstall_std not found
[aarch64] Reading Package Lists...
[aarch64] Building Dependency Tree...
[aarch64] MI2a: marked for install (shallow): rpm-build-python3
[aarch64] MI2a: satisfying Depends: /usr/lib/rpm/python3-site-packages-files.req.list (NULL)
[aarch64] MI2a: maybe install (a providing target): python3-base 3.12.9-alt1:sisyphus+376344.100.1.1 at 1740743731
[aarch64] MI2a: target SELECTED: python3-base 3.12.9-alt1:sisyphus+376344.100.1.1 at 1740743731
[aarch64] MI2a: requesting to install python3-base (unspec'd ver; inspect with Debug::pkgMark-shallow)
[aarch64] MI2a: marked for install (shallow): python3-base
[aarch64] MI2a: satisfying Depends: libb2.so.1()(64bit) >= set:ifZigOjACtTxPlFd1
[aarch64] MI2a: maybe install (a providing target): libb2 0.98.1-alt1_1:sisyphus+291614.100.1.1 at 1638962893
[aarch64] MI2a: target SELECTED: libb2 0.98.1-alt1_1:sisyphus+291614.100.1.1 at 1638962893
[aarch64] MI2a: requesting to install libb2 (unspec'd ver; inspect with Debug::pkgMark-shallow)
[aarch64] MI2a: marked for install (shallow): libb2
[aarch64] MI2a: satisfying Depends: libcrypto.so.3()(64bit) >= set:qjvVyozNavZkZ83WeaDscZzHMrdOZJigtBCBJQvrqD5XYvQVKvoQdMyuy5DglZ0g5OwZmoOe8cvPBvDA6cBvaLWgaBpxJxOiy4PQ61VPZubMZ3n8rmRNMs2wGn4RSjR0c9c1A5eS6d1tOqiG9fzsbR8cS3oOKtZJvgseGSsbtRZilsSSEN1DRb8gDv8fs3HcU8gF3WlVBWjlExhbKgbtaz1KLt7XKJ5D27JXgtZ18MDZrMTmWy25HHepmFdREiSVjMWLMNpNZyHpXytuUNFn4zu8HdlaHqcdQEbR0AZrVT6hvEhZbP0CvmDlGUWpFBONGq3ZhQkbqo2Zvp77PWAt9PjNvDQHWoA60LUZ2eWZ408sfeokZLUV59GXm1
[aarch64] MI2a: maybe install (a providing target): libcrypto3 3.3.3-alt1:sisyphus+374381.40.2.1 at 1739300002
[aarch64] MI2a: target SELECTED: libcrypto3 3.3.3-alt1:sisyphus+374381.40.2.1 at 1739300002
[aarch64] MI2a: requesting to install libcrypto3 (unspec'd ver; inspect with Debug::pkgMark-shallow)
[aarch64] MI2a: marked for install (shallow): libcrypto3
[aarch64] MI2a: satisfying Depends: openssl-config >= 3.2.0-alt1
[aarch64] MI2a: maybe install (a direct target): openssl-config 3.2.0-alt1:sisyphus+366659.140.4.1 at 1736956949
[aarch64] MI2a: target SELECTED: openssl-config 3.2.0-alt1:sisyphus+366659.140.4.1 at 1736956949
[aarch64] MI2a: requesting to install openssl-config (unspec'd ver; inspect with Debug::pkgMark-shallow)
[aarch64] MI2a: marked for install (shallow): openssl-config
[aarch64] MI2a: satisfying Depends: ca-certificates (NULL)
[aarch64] MI2a: maybe install (a direct target): ca-certificates 2025.02.10-alt1:sisyphus+374228.100.4.1 at 1739265441
[aarch64] MI2a: target SELECTED: ca-certificates 2025.02.10-alt1:sisyphus+374228.100.4.1 at 1739265441
[aarch64] MI2a: requesting to install ca-certificates (unspec'd ver; inspect with Debug::pkgMark-shallow)
[aarch64] MI2a: marked for install (shallow): ca-certificates
[aarch64] MI2a: satisfying Depends: ca-trust (NULL)
[aarch64] MI2a: maybe install (a direct target): ca-trust 0.2.0-alt1:sisyphus+344843.100.1.1 at 1712743326
[aarch64] MI2a: target SELECTED: ca-trust 0.2.0-alt1:sisyphus+344843.100.1.1 at 1712743326
[aarch64] MI2a: requesting to install ca-trust (unspec'd ver; inspect with Debug::pkgMark-shallow)
[aarch64] MI2a: marked for install (shallow): ca-trust
[aarch64] MI2a: satisfying Depends: p11-kit-trust (NULL)
[aarch64] MI2a: maybe install (a direct target): p11-kit-trust 1:0.25.5-alt1:sisyphus+352553.100.1.1 at 1720622713
[aarch64] MI2a: target SELECTED: p11-kit-trust 1:0.25.5-alt1:sisyphus+352553.100.1.1 at 1720622713
[aarch64] MI2a: requesting to install p11-kit-trust (unspec'd ver; inspect with Debug::pkgMark-shallow)
[aarch64] MI2a: marked for install (shallow): p11-kit-trust
[aarch64] MI2a: satisfying Depends: /etc/alternatives/packages.d (NULL)
[aarch64] MI2a: maybe install (a providing target): alternatives 0.5.3-alt1:sisyphus+371878.100.1.1 at 1737988822
[aarch64] MI2a: target SELECTED: alternatives 0.5.3-alt1:sisyphus+371878.100.1.1 at 1737988822
[aarch64] MI2a: requesting to install alternatives (unspec'd ver; inspect with Debug::pkgMark-shallow)
[aarch64] MI2a: marked for install (shallow): alternatives
[aarch64] MI2a: satisfying Depends: rpm-macros-alternatives = 0.5.3-alt1:sisyphus+371878.100.1.1
[aarch64] MI2a: maybe install (a direct target): rpm-macros-alternatives 0.5.3-alt1:sisyphus+371878.100.1.1 at 1737988822
[aarch64] MI2a: target SELECTED: rpm-macros-alternatives 0.5.3-alt1:sisyphus+371878.100.1.1 at 1737988822
[aarch64] MI2a: requesting to install rpm-macros-alternatives (unspec'd ver; inspect with Debug::pkgMark-shallow)
[aarch64] MI2a: marked for install (shallow): rpm-macros-alternatives
[aarch64] MI2a: satisfying Depends: libtasn1.so.6()(64bit) >= set:jfRaXblmF8mf5SLNNXDA2CDacDxCZqQOspDh1
[aarch64] MI2a: maybe install (a providing target): libtasn1 4.20.0-alt2:sisyphus+375829.100.1.1 at 1740299365
[aarch64] MI2a: target SELECTED: libtasn1 4.20.0-alt2:sisyphus+375829.100.1.1 at 1740299365
[aarch64] MI2a: requesting to install libtasn1 (unspec'd ver; inspect with Debug::pkgMark-shallow)
[aarch64] MI2a: marked for install (shallow): libtasn1
[aarch64] MI2a: satisfying Depends: libp11-kit = 1:0.25.5-alt1:sisyphus+352553.100.1.1
[aarch64] MI2a: maybe install (a direct target): libp11-kit 1:0.25.5-alt1:sisyphus+352553.100.1.1 at 1720622713
[aarch64] MI2a: target SELECTED: libp11-kit 1:0.25.5-alt1:sisyphus+352553.100.1.1 at 1720622713
[aarch64] MI2a: requesting to install libp11-kit (unspec'd ver; inspect with Debug::pkgMark-shallow)
[aarch64] MI2a: marked for install (shallow): libp11-kit
[aarch64] MI2a: satisfying Depends: libexpat.so.1()(64bit) >= set:keKUFski4R0wXtka97olBOZ17REKhz7nL8ZKWHPFZ33zhdTBZ5OFCUEpIrnbsGoJY0PfVkj7DT11WUO5d0ZFjaYBPnv4YujEVhgTZDgrwOu6Gxfus72
[aarch64] MI2a: maybe install (a providing target): libexpat 2.6.4-alt1:sisyphus+365521.100.1.1 at 1734700274
[aarch64] MI2a: target SELECTED: libexpat 2.6.4-alt1:sisyphus+365521.100.1.1 at 1734700274
[aarch64] MI2a: requesting to install libexpat (unspec'd ver; inspect with Debug::pkgMark-shallow)
[aarch64] MI2a: marked for install (shallow): libexpat
[aarch64] MI2a: satisfying Depends: libgdbm.so.3()(64bit) >= set:iejT6M96OmuT9HlYJ7ooGKIqQHH2
[aarch64] MI2a: maybe install (a providing target): libgdbm 1.8.3-alt10:sisyphus+346222.200.3.2 at 1716468418
[aarch64] MI2a: target SELECTED: libgdbm 1.8.3-alt10:sisyphus+346222.200.3.2 at 1716468418
[aarch64] MI2a: requesting to install libgdbm (unspec'd ver; inspect with Debug::pkgMark-shallow)
[aarch64] MI2a: marked for install (shallow): libgdbm
[aarch64] MI2a: satisfying Depends: libmpdec.so.3()(64bit) >= set:mfKMM5WSnhLDPZvFmnT3UZzrmq8c8YrwNbOV4tWrYtxVLhVcTOCZFhcz3lEuvZcwi6sdFMWQoYneheybZqoHPamXBDDj1tDvOSZufCNoCdhGIsFsMAjgDRP3aaYZo365djtoYzTFzMebqqvYejutWDL4iBFP4DZFz95ekTiFkNlEgOfZbzZAVw77cJS8N8NLq7Xj1XrYJOufSLenVyExgbjfSYF9OtF8u2gC6g0GdyiHcFO9CztZ9gC7OBZzxibA5aSk7Oeqpq1
[aarch64] MI2a: maybe install (a providing target): libmpdec3 2.5.1-alt3:sisyphus+314490.500.5.1 at 1675432086
[aarch64] MI2a: target SELECTED: libmpdec3 2.5.1-alt3:sisyphus+314490.500.5.1 at 1675432086
[aarch64] MI2a: requesting to install libmpdec3 (unspec'd ver; inspect with Debug::pkgMark-shallow)
[aarch64] MI2a: marked for install (shallow): libmpdec3
[aarch64] MI2a: satisfying Depends: libssl.so.3()(64bit) >= set:ngBOW1d2ZbyFSsiZvpkX0aRzeV17bAT5EaRCZmKW9X2fa0fNd4nftXJ29hYi6E6Hd1qMzYIpojXnj8FZ0KI36PY52kehmcLhGf88GJ3zUO9WyKkNnDkFyFFvq53gxZeqsWKMvVkUpsBoqj7VAjzuhGZfzuOCmU78tIFTZE6vRAPZBxpFDwPqZtPdOFkSw9oMZFybd4EYZsbgGSruYHq7wgZsJnrdcfCfu6Zd0MZ5oWXbmMkkRksjebiXUZ3R7
[aarch64] MI2a: maybe install (a providing target): libssl3 3.3.3-alt1:sisyphus+374381.40.2.1 at 1739300002
[aarch64] MI2a: target SELECTED: libssl3 3.3.3-alt1:sisyphus+374381.40.2.1 at 1739300002
[aarch64] MI2a: requesting to install libssl3 (unspec'd ver; inspect with Debug::pkgMark-shallow)
[aarch64] MI2a: marked for install (shallow): libssl3
[aarch64] MI2a: satisfying Depends: python3 = 3.12.9-alt1:sisyphus+376344.100.1.1
[aarch64] MI2a: maybe install (a direct target): python3 3.12.9-alt1:sisyphus+376344.100.1.1 at 1740743731
[aarch64] MI2a: target SELECTED: python3 3.12.9-alt1:sisyphus+376344.100.1.1 at 1740743731
[aarch64] MI2a: requesting to install python3 (unspec'd ver; inspect with Debug::pkgMark-shallow)
[aarch64] MI2a: marked for install (shallow): python3
[aarch64] MI2a: satisfying Depends: python3(py3dephell.py3prov) < 0
[aarch64] MI2a: maybe install (a providing target): python3-module-py3dephell 0.3.1-alt1:sisyphus+365261.200.1.1 at 1734463433
[aarch64] MI2a: target SELECTED: python3-module-py3dephell 0.3.1-alt1:sisyphus+365261.200.1.1 at 1734463433
[aarch64] MI2a: requesting to install python3-module-py3dephell (unspec'd ver; inspect with Debug::pkgMark-shallow)
[aarch64] MI2a: marked for install (shallow): python3-module-py3dephell
[aarch64] MI2a: satisfying Depends: tests-for-installed-python3-pkgs = 0.1.28-alt1:sisyphus+375953.100.2.1
[aarch64] MI2a: maybe install (a direct target): tests-for-installed-python3-pkgs 0.1.28-alt1:sisyphus+375953.100.2.1 at 1740855713
[aarch64] MI2a: target SELECTED: tests-for-installed-python3-pkgs 0.1.28-alt1:sisyphus+375953.100.2.1 at 1740855713
[aarch64] MI2a: requesting to install tests-for-installed-python3-pkgs (unspec'd ver; inspect with Debug::pkgMark-shallow)
[aarch64] MI2a: marked for install (shallow): tests-for-installed-python3-pkgs
[aarch64] MI2a: marked for install (shallow): ccmake
[aarch64] MI2a: satisfying Depends: libform.so.6()(64bit) >= set:kfohZaM38SCHMAGOPHRkO0tFjZ0QmnTZqB1n54sCNSNchoRJlEo0
[aarch64] MI2a: maybe install (a providing target): libncurses6 6.3.20220618-alt4:sisyphus+327286.4600.14.1 at 1711487513
[aarch64] MI2a: target SELECTED: libncurses6 6.3.20220618-alt4:sisyphus+327286.4600.14.1 at 1711487513
[aarch64] MI2a: requesting to install libncurses6 (unspec'd ver; inspect with Debug::pkgMark-shallow)
[aarch64] MI2a: marked for install (shallow): libncurses6
[aarch64] MI2a: satisfying Depends: cmake = 3.31.6-alt1:sisyphus+377691.100.1.1
[aarch64] MI2a: maybe install (a direct target): cmake 3.31.6-alt1:sisyphus+377691.100.1.1 at 1741730843
[aarch64] MI2a: target SELECTED: cmake 3.31.6-alt1:sisyphus+377691.100.1.1 at 1741730843
[aarch64] MI2a: requesting to install cmake (unspec'd ver; inspect with Debug::pkgMark-shallow)
[aarch64] MI2a: marked for install (shallow): cmake
[aarch64] MI2a: satisfying Depends: libarchive.so.13()(64bit) >= set:mfws0SCfLRvPUKXi0gkbE0yqsuzVMI88jwJ7kSDXXM11MUSPfvqwmDm2xDogNmeEkAorJTlC2B1ZatQqH4cJ32OndcAjazDxDaNvG6mMdDQthrMI5Ie5skSvbnLedY5O95MlUcFQ1thxqvQWyDvIECoveyzf0x7I3xw6vu1
[aarch64] MI2a: maybe install (a providing target): libarchive13 3.7.5-alt2:sisyphus+358189.100.1.1 at 1727162825
[aarch64] MI2a: target SELECTED: libarchive13 3.7.5-alt2:sisyphus+358189.100.1.1 at 1727162825
[aarch64] MI2a: requesting to install libarchive13 (unspec'd ver; inspect with Debug::pkgMark-shallow)
[aarch64] MI2a: marked for install (shallow): libarchive13
[aarch64] MI2a: satisfying Depends: libcurl.so.4()(64bit) >= set:kgZtdjewuBSOM3YXjuKGePG56ZAe
[aarch64] MI2a: maybe install (a providing target): libcurl 8.12.1-alt1:sisyphus+374517.100.1.1 at 1739435822
[aarch64] MI2a: target SELECTED: libcurl 8.12.1-alt1:sisyphus+374517.100.1.1 at 1739435822
[aarch64] MI2a: requesting to install libcurl (unspec'd ver; inspect with Debug::pkgMark-shallow)
[aarch64] MI2a: marked for install (shallow): libcurl
[aarch64] MI2a: satisfying Depends: libbrotlidec.so.1()(64bit) >= set:heroOawuYbTK8
[aarch64] MI2a: maybe install (a providing target): libbrotlidec 1.1.0-alt1:sisyphus+328501.100.1.1 at 1693598439
[aarch64] MI2a: target SELECTED: libbrotlidec 1.1.0-alt1:sisyphus+328501.100.1.1 at 1693598439
[aarch64] MI2a: requesting to install libbrotlidec (unspec'd ver; inspect with Debug::pkgMark-shallow)
[aarch64] MI2a: marked for install (shallow): libbrotlidec
[aarch64] MI2a: satisfying Depends: libbrotlicommon = 1.1.0-alt1:sisyphus+328501.100.1.1
[aarch64] MI2a: maybe install (a direct target): libbrotlicommon 1.1.0-alt1:sisyphus+328501.100.1.1 at 1693598439
[aarch64] MI2a: target SELECTED: libbrotlicommon 1.1.0-alt1:sisyphus+328501.100.1.1 at 1693598439
[aarch64] MI2a: requesting to install libbrotlicommon (unspec'd ver; inspect with Debug::pkgMark-shallow)
[aarch64] MI2a: marked for install (shallow): libbrotlicommon
[aarch64] MI2a: satisfying Depends: libgnutls.so.30()(64bit) >= set:ohWzKsl3gEhunQQpmsYd9i7QCtiGyfZ1Iaw1tOFZbdeEKESximCRPnIehs3AEMQXZ0e8KN9yV59f8Zeu5QHTtKkulI9mjuLg9NIizyZhpZCsx8sGEZDBhhgZvpnajdZvocWora9BdPXEcA4Z2ghEYo7SHlnQVUueZmZ3mRKhNiuOM9tTy3ea4NtLvppyZ1rbmbbGWLShwembtEyVtUcNpLjugdka8b4
[aarch64] MI2a: maybe install (a providing target): libgnutls30 3.8.9-alt1:sisyphus+375558.200.1.1 at 1740145691
[aarch64] MI2a: target SELECTED: libgnutls30 3.8.9-alt1:sisyphus+375558.200.1.1 at 1740145691
[aarch64] MI2a: requesting to install libgnutls30 (unspec'd ver; inspect with Debug::pkgMark-shallow)
[aarch64] MI2a: marked for install (shallow): libgnutls30
[aarch64] MI2a: satisfying Depends: libhogweed.so.6()(64bit) >= set:mfnnj2ZgBdeg17M87tPneezLu1hRaAv7Mvee2P332bHTaZjeCozdeChKl8zpQyflmS6Vy6tRmgHXyW1dkybK4gSLUc4ZqST6Otwai2tAwz0231mJ0KXX1SRmE5Wv1xA3elkz1fS4ARIDtHglVAVYGsrdTpOlAk7oFZ51ji2BIsI0W6X7ePZg
[aarch64] MI2a: maybe install (a providing target): libhogweed6 3.10.1-alt1:sisyphus+372008.100.1.1 at 1738078288
[aarch64] MI2a: target SELECTED: libhogweed6 3.10.1-alt1:sisyphus+372008.100.1.1 at 1738078288
[aarch64] MI2a: requesting to install libhogweed6 (unspec'd ver; inspect with Debug::pkgMark-shallow)
[aarch64] MI2a: marked for install (shallow): libhogweed6
[aarch64] MI2a: satisfying Depends: libnettle8 = 3.10.1-alt1:sisyphus+372008.100.1.1
[aarch64] MI2a: maybe install (a direct target): libnettle8 3.10.1-alt1:sisyphus+372008.100.1.1 at 1738078288
[aarch64] MI2a: target SELECTED: libnettle8 3.10.1-alt1:sisyphus+372008.100.1.1 at 1738078288
[aarch64] MI2a: requesting to install libnettle8 (unspec'd ver; inspect with Debug::pkgMark-shallow)
[aarch64] MI2a: marked for install (shallow): libnettle8
[aarch64] MI2a: satisfying Depends: libidn2.so.0()(64bit) >= set:ifaFMURofX11
[aarch64] MI2a: maybe install (a providing target): libidn2 2.3.7-alt1:sisyphus+339505.100.1.2 at 1706719034
[aarch64] MI2a: target SELECTED: libidn2 2.3.7-alt1:sisyphus+339505.100.1.2 at 1706719034
[aarch64] MI2a: requesting to install libidn2 (unspec'd ver; inspect with Debug::pkgMark-shallow)
[aarch64] MI2a: marked for install (shallow): libidn2
[aarch64] MI2a: satisfying Depends: libgsasl.so.18()(64bit) >= set:jfNMMjxjlLiKUyEAZvcPMCX3
[aarch64] MI2a: maybe install (a providing target): libgsasl18 2.2.1-alt2:sisyphus+359713.200.2.1 at 1728905495
[aarch64] MI2a: target SELECTED: libgsasl18 2.2.1-alt2:sisyphus+359713.200.2.1 at 1728905495
[aarch64] MI2a: requesting to install libgsasl18 (unspec'd ver; inspect with Debug::pkgMark-shallow)
[aarch64] MI2a: marked for install (shallow): libgsasl18
[aarch64] MI2a: satisfying Depends: libgssapi_krb5.so.2()(64bit) >= set:lgUI5pnpbNsJUr9F0ECN6LIbSVz7j3UNHAXVG0YYmbjijMyN
[aarch64] MI2a: maybe install (a providing target): libkrb5 1.21.3-alt2:sisyphus+351857.100.1.1 at 1719735346
[aarch64] MI2a: target SELECTED: libkrb5 1.21.3-alt2:sisyphus+351857.100.1.1 at 1719735346
[aarch64] MI2a: requesting to install libkrb5 (unspec'd ver; inspect with Debug::pkgMark-shallow)
[aarch64] MI2a: marked for install (shallow): libkrb5
[aarch64] MI2a: satisfying Depends: libcom_err.so.2()(64bit) >= set:ifPl8xIvqFmQe8JQo3
[aarch64] MI2a: maybe install (a providing target): libcom_err 1.47.1.0.10.ad56-alt2:sisyphus+363497.200.3.1 at 1732729972
[aarch64] MI2a: target SELECTED: libcom_err 1.47.1.0.10.ad56-alt2:sisyphus+363497.200.3.1 at 1732729972
[aarch64] MI2a: requesting to install libcom_err (unspec'd ver; inspect with Debug::pkgMark-shallow)
[aarch64] MI2a: marked for install (shallow): libcom_err
[aarch64] MI2a: satisfying Depends: libkeyutils.so.1()(64bit) >= set:jfWn12U6KThBXgruPLZ68yYZt2
[aarch64] MI2a: maybe install (a providing target): libkeyutils 1.6.3-alt1:sisyphus+346336.200.2.2 at 1716472668
[aarch64] MI2a: target SELECTED: libkeyutils 1.6.3-alt1:sisyphus+346336.200.2.2 at 1716472668
[aarch64] MI2a: requesting to install libkeyutils (unspec'd ver; inspect with Debug::pkgMark-shallow)
[aarch64] MI2a: marked for install (shallow): libkeyutils
[aarch64] MI2a: satisfying Depends: liblmdb.so.0()(64bit) >= set:kfalKd4xYAkaAG2MqeH0wB2F4kTaBEo1iv0KFpxVmqzFIV6HJ0
[aarch64] MI2a: maybe install (a providing target): liblmdb 0.9.33-alt1:sisyphus+360625.100.1.1 at 1729819647
[aarch64] MI2a: target SELECTED: liblmdb 0.9.33-alt1:sisyphus+360625.100.1.1 at 1729819647
[aarch64] MI2a: requesting to install liblmdb (unspec'd ver; inspect with Debug::pkgMark-shallow)
[aarch64] MI2a: marked for install (shallow): liblmdb
[aarch64] MI2a: satisfying Depends: libverto.so.1()(64bit) >= set:jfI5MRvI6tmNn0zwQdb68Gk0
[aarch64] MI2a: maybe install (a providing target): libverto 0.3.2-alt1_1:sisyphus+321176.2200.10.2 at 1684805800
[aarch64] MI2a: target SELECTED: libverto 0.3.2-alt1_1:sisyphus+321176.2200.10.2 at 1684805800
[aarch64] MI2a: requesting to install libverto (unspec'd ver; inspect with Debug::pkgMark-shallow)
[aarch64] MI2a: marked for install (shallow): libverto
[aarch64] MI2a: satisfying Depends: libidn.so.12()(64bit) >= set:kiBXars6
[aarch64] MI2a: maybe install (a providing target): libidn 1.37-alt2:sisyphus+300849.100.1.1 at 1653769726
[aarch64] MI2a: target SELECTED: libidn 1.37-alt2:sisyphus+300849.100.1.1 at 1653769726
[aarch64] MI2a: requesting to install libidn (unspec'd ver; inspect with Debug::pkgMark-shallow)
[aarch64] MI2a: marked for install (shallow): libidn
[aarch64] MI2a: satisfying Depends: libntlm.so.0()(64bit) >= set:hfknJM1
[aarch64] MI2a: maybe install (a providing target): libntlm 1.5-alt1:sisyphus+278100.3300.1.1 at 1626059959
[aarch64] MI2a: target SELECTED: libntlm 1.5-alt1:sisyphus+278100.3300.1.1 at 1626059959
[aarch64] MI2a: requesting to install libntlm (unspec'd ver; inspect with Debug::pkgMark-shallow)
[aarch64] MI2a: marked for install (shallow): libntlm
[aarch64] MI2a: satisfying Depends: liblber.so.2()(64bit) >= set:liRJP9c9FzZ8q5FR
[aarch64] MI2a: maybe install (a providing target): libldap2 2.6.9-alt2:sisyphus+367501.300.4.1 at 1735841964
[aarch64] MI2a: target SELECTED: libldap2 2.6.9-alt2:sisyphus+367501.300.4.1 at 1735841964
[aarch64] MI2a: requesting to install libldap2 (unspec'd ver; inspect with Debug::pkgMark-shallow)
[aarch64] MI2a: marked for install (shallow): libldap2
[aarch64] MI2a: satisfying Depends: libsasl2.so.3()(64bit) >= set:lhKAh7QjCM36Vnr6MdFxFf8LIcZsS1kl0wH7Iyp
[aarch64] MI2a: maybe install (a providing target): libsasl2-3 2.1.28-alt2.1:sisyphus+367419.100.1.1 at 1735482603
[aarch64] MI2a: target SELECTED: libsasl2-3 2.1.28-alt2.1:sisyphus+367419.100.1.1 at 1735482603
[aarch64] MI2a: requesting to install libsasl2-3 (unspec'd ver; inspect with Debug::pkgMark-shallow)
[aarch64] MI2a: marked for install (shallow): libsasl2-3
[aarch64] MI2a: satisfying Depends: openldap-common = 2.6.9-alt2:sisyphus+367501.300.4.1
[aarch64] MI2a: maybe install (a direct target): openldap-common 2.6.9-alt2:sisyphus+367501.300.4.1 at 1735841751
[aarch64] MI2a: target SELECTED: openldap-common 2.6.9-alt2:sisyphus+367501.300.4.1 at 1735841751
[aarch64] MI2a: requesting to install openldap-common (unspec'd ver; inspect with Debug::pkgMark-shallow)
[aarch64] MI2a: marked for install (shallow): openldap-common
[aarch64] MI2a: satisfying Depends: libnghttp2.so.14()(64bit) >= set:lfKRgJ8UKsv8mdZbLF8UZpCjqzxjS4uXpINNNC9lNPxPEJZqw9IfpEB51C0QFeHEVpGv95xGtf4CksgxNiZbJO6CvE4RCQxaKbdf6IG29SZkOus
[aarch64] MI2a: maybe install (a providing target): libnghttp2 1.65.0-alt1:sisyphus+377060.100.1.1 at 1741259371
[aarch64] MI2a: target SELECTED: libnghttp2 1.65.0-alt1:sisyphus+377060.100.1.1 at 1741259371
[aarch64] MI2a: requesting to install libnghttp2 (unspec'd ver; inspect with Debug::pkgMark-shallow)
[aarch64] MI2a: marked for install (shallow): libnghttp2
[aarch64] MI2a: satisfying Depends: libnghttp3.so.9()(64bit) >= set:kfOHsymuRovZfZIawj4STEmrF1Xh8iHADhCWQYMeA3u6CuDIW7ipo3
[aarch64] MI2a: maybe install (a providing target): libnghttp3.9 1.8.0-alt1:sisyphus+375942.100.1.1 at 1740420799
[aarch64] MI2a: target SELECTED: libnghttp3.9 1.8.0-alt1:sisyphus+375942.100.1.1 at 1740420799
[aarch64] MI2a: requesting to install libnghttp3.9 (unspec'd ver; inspect with Debug::pkgMark-shallow)
[aarch64] MI2a: marked for install (shallow): libnghttp3.9
[aarch64] MI2a: satisfying Depends: libngtcp2.so.16()(64bit) >= set:keggzSiMInQoBwKw3hOFjw6C4r5lyewzRrbvfiZqFvO6xZ2fVcSxD0qyPdhyUVRzsodbhSgNzKYVngELjUy4
[aarch64] MI2a: maybe install (a providing target): libngtcp2.16 1.11.0-alt2:sisyphus+376238.100.1.1 at 1740635119
[aarch64] MI2a: target SELECTED: libngtcp2.16 1.11.0-alt2:sisyphus+376238.100.1.1 at 1740635119
[aarch64] MI2a: requesting to install libngtcp2.16 (unspec'd ver; inspect with Debug::pkgMark-shallow)
[aarch64] MI2a: marked for install (shallow): libngtcp2.16
[aarch64] MI2a: satisfying Depends: libngtcp2_crypto_gnutls8 = 1.11.0-alt2:sisyphus+376238.100.1.1
[aarch64] MI2a: maybe install (a direct target): libngtcp2_crypto_gnutls8 1.11.0-alt2:sisyphus+376238.100.1.1 at 1740635119
[aarch64] MI2a: target SELECTED: libngtcp2_crypto_gnutls8 1.11.0-alt2:sisyphus+376238.100.1.1 at 1740635119
[aarch64] MI2a: requesting to install libngtcp2_crypto_gnutls8 (unspec'd ver; inspect with Debug::pkgMark-shallow)
[aarch64] MI2a: marked for install (shallow): libngtcp2_crypto_gnutls8
[aarch64] MI2a: satisfying Depends: libpsl.so.5()(64bit) >= set:ifo8sG4NYozTZj0
[aarch64] MI2a: maybe install (a providing target): libpsl 0.21.5-alt1:sisyphus+338474.100.1.1 at 1705684797
[aarch64] MI2a: target SELECTED: libpsl 0.21.5-alt1:sisyphus+338474.100.1.1 at 1705684797
[aarch64] MI2a: requesting to install libpsl (unspec'd ver; inspect with Debug::pkgMark-shallow)
[aarch64] MI2a: marked for install (shallow): libpsl
[aarch64] MI2a: satisfying Depends: publicsuffix-list-dafsa (NULL)
[aarch64] MI2a: maybe install (a direct target): publicsuffix-list-dafsa 20250131-alt1:sisyphus+373297.100.1.1 at 1738767834
[aarch64] MI2a: target SELECTED: publicsuffix-list-dafsa 20250131-alt1:sisyphus+373297.100.1.1 at 1738767834
[aarch64] MI2a: requesting to install publicsuffix-list-dafsa (unspec'd ver; inspect with Debug::pkgMark-shallow)
[aarch64] MI2a: marked for install (shallow): publicsuffix-list-dafsa
[aarch64] MI2a: satisfying Depends: libssh2.so.1()(64bit) >= set:lfFi2ZJdCZnNQqC7FxZHyYYVCMxI4j1759y3AVs98cSjdm6BZrMSTPA4BKYeWR49vSI0JGO8E3yldZ5j77X8z3joPyGVoiqovNAwPc5RvPDTKNRR6pS6H80qi1nxAdsxOdZERlIwndLqIyuVb
[aarch64] MI2a: maybe install (a providing target): libssh2 1.11.0-alt2:sisyphus+339356.100.1.1 at 1706593172
[aarch64] MI2a: target SELECTED: libssh2 1.11.0-alt2:sisyphus+339356.100.1.1 at 1706593172
[aarch64] MI2a: requesting to install libssh2 (unspec'd ver; inspect with Debug::pkgMark-shallow)
[aarch64] MI2a: marked for install (shallow): libssh2
[aarch64] MI2a: satisfying Depends: libjsoncpp.so.24()(64bit) >= set:mfWdNr9hSTEj33pgekkWiZ5gxiSrhe4i6fCrcyUrA0F5fpZ04ebvZEaLNDQoZ1XGHPAxHVDJ5aZ8J4EOS5Ph9IjMNpQdqYunbBZ41SG8ORLJvBHW7puYYi760ZFTIxHsoUGjwulnr1aj60ioshZ86OzriUK928mFrs77eRe9dru2y166FawAr1edD77euJ7rtNk5haAjh7jgSNVf
[aarch64] MI2a: maybe install (a providing target): libjsoncpp24 1.9.4-alt2:sisyphus+346331.200.2.1 at 1716448565
[aarch64] MI2a: target SELECTED: libjsoncpp24 1.9.4-alt2:sisyphus+346331.200.2.1 at 1716448565
[aarch64] MI2a: requesting to install libjsoncpp24 (unspec'd ver; inspect with Debug::pkgMark-shallow)
[aarch64] MI2a: marked for install (shallow): libjsoncpp24
[aarch64] MI2a: satisfying Depends: librhash.so.0()(64bit) >= set:ifDyZ6eqLIBMAAMoeF3
[aarch64] MI2a: maybe install (a providing target): librhash 1.3.5-alt3:sisyphus+286141.40.2.1 at 1632982460
[aarch64] MI2a: target SELECTED: librhash 1.3.5-alt3:sisyphus+286141.40.2.1 at 1632982460
[aarch64] MI2a: requesting to install librhash (unspec'd ver; inspect with Debug::pkgMark-shallow)
[aarch64] MI2a: marked for install (shallow): librhash
[aarch64] MI2a: satisfying Depends: libuv.so.1()(64bit) >= set:mhRqUeic58tAOj8qzoZvhgcZFirSpyDd3iNFI57V8pPeIZrSvAPv9Z9Udh8e5kJuikPvq0
[aarch64] MI2a: maybe install (a providing target): libuv 1.50.0-alt1:sisyphus+377760.100.1.1 at 1741795938
[aarch64] MI2a: target SELECTED: libuv 1.50.0-alt1:sisyphus+377760.100.1.1 at 1741795938
[aarch64] MI2a: requesting to install libuv (unspec'd ver; inspect with Debug::pkgMark-shallow)
[aarch64] MI2a: marked for install (shallow): libuv
[aarch64] MI2a: satisfying Depends: cmake-modules = 3.31.6-alt1:sisyphus+377691.100.1.1
[aarch64] MI2a: maybe install (a direct target): cmake-modules 3.31.6-alt1:sisyphus+377691.100.1.1 at 1741730513
[aarch64] MI2a: target SELECTED: cmake-modules 3.31.6-alt1:sisyphus+377691.100.1.1 at 1741730513
[aarch64] MI2a: requesting to install cmake-modules (unspec'd ver; inspect with Debug::pkgMark-shallow)
[aarch64] MI2a: marked for install (shallow): cmake-modules
[aarch64] MI2a: marked for install (shallow): gcc-c++
[aarch64] MI2a: satisfying Depends: gcc14-c++ (NULL)
[aarch64] MI2a: maybe install (a direct target): gcc14-c++ 14.2.1-alt1:sisyphus+360995.100.1.1 at 1730138260
[aarch64] MI2a: target SELECTED: gcc14-c++ 14.2.1-alt1:sisyphus+360995.100.1.1 at 1730138260
[aarch64] MI2a: requesting to install gcc14-c++ (unspec'd ver; inspect with Debug::pkgMark-shallow)
[aarch64] MI2a: marked for install (shallow): gcc14-c++
[aarch64] MI2a: satisfying Depends: libstdc++14-devel = 14.2.1-alt1:sisyphus+360995.100.1.1
[aarch64] MI2a: maybe install (a direct target): libstdc++14-devel 14.2.1-alt1:sisyphus+360995.100.1.1 at 1730138260
[aarch64] MI2a: target SELECTED: libstdc++14-devel 14.2.1-alt1:sisyphus+360995.100.1.1 at 1730138260
[aarch64] MI2a: requesting to install libstdc++14-devel (unspec'd ver; inspect with Debug::pkgMark-shallow)
[aarch64] MI2a: marked for install (shallow): libstdc++14-devel
[aarch64] MI2a: satisfying PreDepends: gcc-c++-common >= 1.4.7
[aarch64] MI2a: maybe install (a direct target): gcc-c++-common 1.4.28-alt1:sisyphus+348678.100.1.1 at 1716396142
[aarch64] MI2a: target SELECTED: gcc-c++-common 1.4.28-alt1:sisyphus+348678.100.1.1 at 1716396142
[aarch64] MI2a: requesting to install gcc-c++-common (unspec'd ver; inspect with Debug::pkgMark-shallow)
[aarch64] MI2a: marked for install (shallow): gcc-c++-common
[aarch64] MI2a: marked for install (shallow): python3-dev
[aarch64] MI2a: satisfying Depends: libncurses-devel (NULL)
[aarch64] MI2a: maybe install (a direct target): libncurses-devel 6.3.20220618-alt4:sisyphus+327286.4600.14.1 at 1711487513
[aarch64] MI2a: target SELECTED: libncurses-devel 6.3.20220618-alt4:sisyphus+327286.4600.14.1 at 1711487513
[aarch64] MI2a: requesting to install libncurses-devel (unspec'd ver; inspect with Debug::pkgMark-shallow)
[aarch64] MI2a: marked for install (shallow): libncurses-devel
[aarch64] MI2a: satisfying Depends: libtinfo-devel = 6.3.20220618-alt4:sisyphus+327286.4600.14.1
[aarch64] MI2a: maybe install (a direct target): libtinfo-devel 6.3.20220618-alt4:sisyphus+327286.4600.14.1 at 1711487513
[aarch64] MI2a: target SELECTED: libtinfo-devel 6.3.20220618-alt4:sisyphus+327286.4600.14.1 at 1711487513
[aarch64] MI2a: requesting to install libtinfo-devel (unspec'd ver; inspect with Debug::pkgMark-shallow)
[aarch64] MI2a: marked for install (shallow): libtinfo-devel
[aarch64] MI2a: satisfying Depends: libpython3 = 3.12.9-alt1:sisyphus+376344.100.1.1
[aarch64] MI2a: maybe install (a direct target): libpython3 3.12.9-alt1:sisyphus+376344.100.1.1 at 1740743731
[aarch64] MI2a: target SELECTED: libpython3 3.12.9-alt1:sisyphus+376344.100.1.1 at 1740743731
[aarch64] MI2a: requesting to install libpython3 (unspec'd ver; inspect with Debug::pkgMark-shallow)
[aarch64] MI2a: marked for install (shallow): libpython3
[aarch64] MI2a: marked for install (shallow): libaio-devel
[aarch64] MI2a: satisfying Depends: libaio = 0.3.113-alt2:sisyphus+335254.100.1.1
[aarch64] MI2a: maybe install (a direct target): libaio 0.3.113-alt2:sisyphus+335254.100.1.1 at 1701100083
[aarch64] MI2a: target SELECTED: libaio 0.3.113-alt2:sisyphus+335254.100.1.1 at 1701100083
[aarch64] MI2a: requesting to install libaio (unspec'd ver; inspect with Debug::pkgMark-shallow)
[aarch64] MI2a: marked for install (shallow): libaio
[aarch64] MI2a: marked for install (shallow): libedit-devel
[aarch64] MI2a: satisfying Depends: libedit3 = 3.1.20230828-alt1:sisyphus+330914.200.3.1
[aarch64] MI2a: maybe install (a direct target): libedit3 3.1.20230828-alt1:sisyphus+330914.200.3.1 at 1696922768
[aarch64] MI2a: target SELECTED: libedit3 3.1.20230828-alt1:sisyphus+330914.200.3.1 at 1696922768
[aarch64] MI2a: requesting to install libedit3 (unspec'd ver; inspect with Debug::pkgMark-shallow)
[aarch64] MI2a: marked for install (shallow): libedit3
[aarch64] MI2a: marked for install (shallow): libevent-devel
[aarch64] MI2a: satisfying Depends: libevent2.1 = 2.1.12-alt1:sisyphus+324359.3500.11.1
[aarch64] MI2a: maybe install (a direct target): libevent2.1 2.1.12-alt1:sisyphus+324359.3500.11.1 at 1689364994
[aarch64] MI2a: target SELECTED: libevent2.1 2.1.12-alt1:sisyphus+324359.3500.11.1 at 1689364994
[aarch64] MI2a: requesting to install libevent2.1 (unspec'd ver; inspect with Debug::pkgMark-shallow)
[aarch64] MI2a: marked for install (shallow): libevent2.1
[aarch64] MI2a: marked for install (shallow): liblz4-devel
[aarch64] MI2a: satisfying Depends: liblz4 = 1:1.9.4-alt1:sisyphus+309416.100.1.1
[aarch64] MI2a: maybe install (a direct target): liblz4 1:1.9.4-alt1:sisyphus+309416.100.1.1 at 1667413074
[aarch64] MI2a: target SELECTED: liblz4 1:1.9.4-alt1:sisyphus+309416.100.1.1 at 1667413074
[aarch64] MI2a: requesting to install liblz4 (unspec'd ver; inspect with Debug::pkgMark-shallow)
[aarch64] MI2a: marked for install (shallow): liblz4
[aarch64] MI2a: marked for install (shallow): libsystemd-devel
[aarch64] MI2a: satisfying Depends: libsystemd = 1:255.16-alt1:sisyphus+368218.100.2.1
[aarch64] MI2a: maybe install (a direct target): libsystemd 1:255.16-alt1:sisyphus+368218.100.2.1 at 1736512369
[aarch64] MI2a: target SELECTED: libsystemd 1:255.16-alt1:sisyphus+368218.100.2.1 at 1736512369
[aarch64] MI2a: requesting to install libsystemd (unspec'd ver; inspect with Debug::pkgMark-shallow)
[aarch64] MI2a: marked for install (shallow): libsystemd
[aarch64] MI2a: marked for install (shallow): protobuf-compiler
[aarch64] MI2a: satisfying Depends: libabsl_log_initialize.so.2501.0.0()(64bit) >= set:dcee
[aarch64] MI2a: maybe install (a providing target): libabseil-cpp2501.0.0 20250127.0-alt1:sisyphus+375199.100.1.1 at 1739879679
[aarch64] MI2a: target SELECTED: libabseil-cpp2501.0.0 20250127.0-alt1:sisyphus+375199.100.1.1 at 1739879679
[aarch64] MI2a: requesting to install libabseil-cpp2501.0.0 (unspec'd ver; inspect with Debug::pkgMark-shallow)
[aarch64] MI2a: marked for install (shallow): libabseil-cpp2501.0.0
[aarch64] MI2a: satisfying Depends: libgtest.so.1.15.2()(64bit) >= set:nlQvVs7GlDjk
[aarch64] MI2a: maybe install (a providing target): libgtest 1.15.2-alt1:sisyphus+364140.100.8.1 at 1733730081
[aarch64] MI2a: target SELECTED: libgtest 1.15.2-alt1:sisyphus+364140.100.8.1 at 1733730081
[aarch64] MI2a: requesting to install libgtest (unspec'd ver; inspect with Debug::pkgMark-shallow)
[aarch64] MI2a: marked for install (shallow): libgtest
[aarch64] MI2a: satisfying Depends: libprotobuf25 = 3.25.5-alt6:sisyphus+372112.176.37.1
[aarch64] MI2a: maybe install (a direct target): libprotobuf25 3.25.5-alt6:sisyphus+372112.176.37.1 at 1741279024
[aarch64] MI2a: target SELECTED: libprotobuf25 3.25.5-alt6:sisyphus+372112.176.37.1 at 1741279024
[aarch64] MI2a: requesting to install libprotobuf25 (unspec'd ver; inspect with Debug::pkgMark-shallow)
[aarch64] MI2a: marked for install (shallow): libprotobuf25
[aarch64] MI2a: marked for install (shallow): libprotobuf-lite-devel
[aarch64] MI2a: satisfying Depends: libprotobuf25-lite = 3.25.5-alt6:sisyphus+372112.176.37.1
[aarch64] MI2a: maybe install (a direct target): libprotobuf25-lite 3.25.5-alt6:sisyphus+372112.176.37.1 at 1741279024
[aarch64] MI2a: target SELECTED: libprotobuf25-lite 3.25.5-alt6:sisyphus+372112.176.37.1 at 1741279024
[aarch64] MI2a: requesting to install libprotobuf25-lite (unspec'd ver; inspect with Debug::pkgMark-shallow)
[aarch64] MI2a: marked for install (shallow): libprotobuf25-lite
[aarch64] MI2a: satisfying Depends: libprotobuf-devel = 3.25.5-alt6:sisyphus+372112.176.37.1
[aarch64] MI2a: maybe install (a direct target): libprotobuf-devel 3.25.5-alt6:sisyphus+372112.176.37.1 at 1741279024
[aarch64] MI2a: target SELECTED: libprotobuf-devel 3.25.5-alt6:sisyphus+372112.176.37.1 at 1741279024
[aarch64] MI2a: requesting to install libprotobuf-devel (unspec'd ver; inspect with Debug::pkgMark-shallow)
[aarch64] MI2a: marked for install (shallow): libprotobuf-devel
[aarch64] MI2a: satisfying Depends: libabseil-cpp-devel (NULL)
[aarch64] MI2a: maybe install (a direct target): libabseil-cpp-devel 20250127.0-alt1:sisyphus+375199.100.1.1 at 1739879679
[aarch64] MI2a: target SELECTED: libabseil-cpp-devel 20250127.0-alt1:sisyphus+375199.100.1.1 at 1739879679
[aarch64] MI2a: requesting to install libabseil-cpp-devel (unspec'd ver; inspect with Debug::pkgMark-shallow)
[aarch64] MI2a: marked for install (shallow): libabseil-cpp-devel
[aarch64] MI2a: satisfying Depends: libgmock-devel (NULL)
[aarch64] MI2a: maybe install (a direct target): libgmock-devel 1.15.2-alt1:sisyphus+364140.100.8.1 at 1733730081
[aarch64] MI2a: target SELECTED: libgmock-devel 1.15.2-alt1:sisyphus+364140.100.8.1 at 1733730081
[aarch64] MI2a: requesting to install libgmock-devel (unspec'd ver; inspect with Debug::pkgMark-shallow)
[aarch64] MI2a: marked for install (shallow): libgmock-devel
[aarch64] MI2a: satisfying Depends: libgtest-devel = 1.15.2-alt1:sisyphus+364140.100.8.1
[aarch64] MI2a: maybe install (a direct target): libgtest-devel 1.15.2-alt1:sisyphus+364140.100.8.1 at 1733730081
[aarch64] MI2a: target SELECTED: libgtest-devel 1.15.2-alt1:sisyphus+364140.100.8.1 at 1733730081
[aarch64] MI2a: requesting to install libgtest-devel (unspec'd ver; inspect with Debug::pkgMark-shallow)
[aarch64] MI2a: marked for install (shallow): libgtest-devel
[aarch64] MI2a: satisfying Depends: libgmock = 1.15.2-alt1:sisyphus+364140.100.8.1
[aarch64] MI2a: maybe install (a direct target): libgmock 1.15.2-alt1:sisyphus+364140.100.8.1 at 1733730081
[aarch64] MI2a: target SELECTED: libgmock 1.15.2-alt1:sisyphus+364140.100.8.1 at 1733730081
[aarch64] MI2a: requesting to install libgmock (unspec'd ver; inspect with Debug::pkgMark-shallow)
[aarch64] MI2a: marked for install (shallow): libgmock
[aarch64] MI2a: satisfying Depends: libabseil-cpp-testing = 20250127.0-alt1:sisyphus+375199.100.1.1
[aarch64] MI2a: maybe install (a direct target): libabseil-cpp-testing 20250127.0-alt1:sisyphus+375199.100.1.1 at 1739879679
[aarch64] MI2a: target SELECTED: libabseil-cpp-testing 20250127.0-alt1:sisyphus+375199.100.1.1 at 1739879679
[aarch64] MI2a: requesting to install libabseil-cpp-testing (unspec'd ver; inspect with Debug::pkgMark-shallow)
[aarch64] MI2a: marked for install (shallow): libabseil-cpp-testing
[aarch64] MI2a: marked for install (shallow): libcurl-devel
[aarch64] MI2a: satisfying Depends: bc (NULL)
[aarch64] MI2a: maybe install (a direct target): bc 1:1.07.1-alt1:sisyphus+346065.200.3.1 at 1716459118
[aarch64] MI2a: target SELECTED: bc 1:1.07.1-alt1:sisyphus+346065.200.3.1 at 1716459118
[aarch64] MI2a: requesting to install bc (unspec'd ver; inspect with Debug::pkgMark-shallow)
[aarch64] MI2a: marked for install (shallow): bc
[aarch64] MI2a: marked for install (shallow): libicu-devel
[aarch64] MI2a: satisfying Depends: icu-utils = 1:7.6.1-alt1:sisyphus+375553.100.1.1
[aarch64] MI2a: maybe install (a direct target): icu-utils 1:7.6.1-alt1:sisyphus+375553.100.1.1 at 1740138258
[aarch64] MI2a: target SELECTED: icu-utils 1:7.6.1-alt1:sisyphus+375553.100.1.1 at 1740138258
[aarch64] MI2a: requesting to install icu-utils (unspec'd ver; inspect with Debug::pkgMark-shallow)
[aarch64] MI2a: marked for install (shallow): icu-utils
[aarch64] MI2a: satisfying Depends: libicu76 = 1:7.6.1-alt1:sisyphus+375553.100.1.1
[aarch64] MI2a: maybe install (a direct target): libicu76 1:7.6.1-alt1:sisyphus+375553.100.1.1 at 1740138258
[aarch64] MI2a: target SELECTED: libicu76 1:7.6.1-alt1:sisyphus+375553.100.1.1 at 1740138258
[aarch64] MI2a: requesting to install libicu76 (unspec'd ver; inspect with Debug::pkgMark-shallow)
[aarch64] MI2a: marked for install (shallow): libicu76
[aarch64] MI2a: marked for install (shallow): libtirpc-devel
[aarch64] MI2a: satisfying Depends: libkrb5-devel (NULL)
[aarch64] MI2a: maybe install (a direct target): libkrb5-devel 1.21.3-alt2:sisyphus+351857.100.1.1 at 1719735346
[aarch64] MI2a: target SELECTED: libkrb5-devel 1.21.3-alt2:sisyphus+351857.100.1.1 at 1719735346
[aarch64] MI2a: requesting to install libkrb5-devel (unspec'd ver; inspect with Debug::pkgMark-shallow)
[aarch64] MI2a: marked for install (shallow): libkrb5-devel
[aarch64] MI2a: satisfying Depends: libcom_err-devel (NULL)
[aarch64] MI2a: maybe install (a direct target): libcom_err-devel 1.47.1.0.10.ad56-alt2:sisyphus+363497.200.3.1 at 1732729972
[aarch64] MI2a: target SELECTED: libcom_err-devel 1.47.1.0.10.ad56-alt2:sisyphus+363497.200.3.1 at 1732729972
[aarch64] MI2a: requesting to install libcom_err-devel (unspec'd ver; inspect with Debug::pkgMark-shallow)
[aarch64] MI2a: marked for install (shallow): libcom_err-devel
[aarch64] MI2a: satisfying Depends: libverto-devel (NULL)
[aarch64] MI2a: maybe install (a direct target): libverto-devel 0.3.2-alt1_1:sisyphus+321176.2200.10.2 at 1684805800
[aarch64] MI2a: target SELECTED: libverto-devel 0.3.2-alt1_1:sisyphus+321176.2200.10.2 at 1684805800
[aarch64] MI2a: requesting to install libverto-devel (unspec'd ver; inspect with Debug::pkgMark-shallow)
[aarch64] MI2a: marked for install (shallow): libverto-devel
[aarch64] MI2a: satisfying Depends: libkrb5-ldap = 1.21.3-alt2:sisyphus+351857.100.1.1
[aarch64] MI2a: maybe install (a direct target): libkrb5-ldap 1.21.3-alt2:sisyphus+351857.100.1.1 at 1719735346
[aarch64] MI2a: target SELECTED: libkrb5-ldap 1.21.3-alt2:sisyphus+351857.100.1.1 at 1719735346
[aarch64] MI2a: requesting to install libkrb5-ldap (unspec'd ver; inspect with Debug::pkgMark-shallow)
[aarch64] MI2a: marked for install (shallow): libkrb5-ldap
[aarch64] MI2a: satisfying Depends: libtirpc = 1.3.6-alt1:sisyphus+360096.100.1.1
[aarch64] MI2a: maybe install (a direct target): libtirpc 1.3.6-alt1:sisyphus+360096.100.1.1 at 1729241824
[aarch64] MI2a: target SELECTED: libtirpc 1.3.6-alt1:sisyphus+360096.100.1.1 at 1729241824
[aarch64] MI2a: requesting to install libtirpc (unspec'd ver; inspect with Debug::pkgMark-shallow)
[aarch64] MI2a: marked for install (shallow): libtirpc
[aarch64] E: Couldn't find package libquadmath-devel
[aarch64] hsh-install: Failed to calculate package file list.
[aarch64] hsh-install: Failed to generate package file list.
2025-Mar-14 12:22:16 :: [aarch64] MySQL.git 8.4.4-alt1: remote: cannot build src.rpm
2025-Mar-14 12:22:16 :: [aarch64] #100 MySQL.git 8.4.4-alt1: build FAILED
2025-Mar-14 12:22:16 :: [aarch64] requesting cancellation of task processing
[i586] -- Looking for stdint.h
[i586] -- Looking for stdint.h - found
[i586] -- Looking for stddef.h
[i586] -- Looking for stddef.h - found
[i586] -- Check size of void *
[i586] -- Check size of void * - done
[i586] -- SIZEOF_VOIDP 4
[i586] CMake Error at CMakeLists.txt:681 (MESSAGE):
[i586] MySQL supports only 64-bit platforms.
[i586] -- Configuring incomplete, errors occurred!
2025-Mar-14 12:24:35 :: [i586] MySQL.git 8.4.4-alt1: remote: build failed
2025-Mar-14 12:24:35 :: [i586] #100 MySQL.git 8.4.4-alt1: build FAILED
2025-Mar-14 12:53:13 :: [x86_64] #100 MySQL.git 8.4.4-alt1: build OK
2025-Mar-14 12:22:16 :: [aarch64] build FAILED
2025-Mar-14 12:24:35 :: [i586] build FAILED
2025-Mar-14 12:53:14 :: task #374162 for sisyphus FAILED
More information about the Sisyphus-incominger
mailing list