[#377893] [test-only] p10 FAILED (try 2) srpm=blueprint-compiler-0.16.0-alt1.src.rpm lact.git=0.7.1-alt1

Girar awaiter (lav) girar-builder at altlinux.org
Fri Mar 14 01:27:54 MSK 2025


https://git.altlinux.org/tasks/377893/logs/events.2.1.log
https://packages.altlinux.org/tasks/377893

subtask  name                aarch64    armh    i586  x86_64
    #40  blueprint-compiler   failed  failed  failed  failed

2025-Mar-13 22:26:24 :: test-only task #377893 for p10 resumed by lav:
#40 build blueprint-compiler-0.16.0-alt1.src.rpm from sisyphus
#100 build 0.7.1-alt1 from /gears/l/lact.git fetched at 2025-Mar-13 22:21:44 from sisyphus
2025-Mar-13 22:26:24 :: created build repo
2025-Mar-13 22:26:25 :: #100: force rebuild
2025-Mar-13 22:26:25 :: [i586] #40 blueprint-compiler-0.16.0-alt1.src.rpm: build start
2025-Mar-13 22:26:25 :: [aarch64] #40 blueprint-compiler-0.16.0-alt1.src.rpm: build start
2025-Mar-13 22:26:25 :: [armh] #40 blueprint-compiler-0.16.0-alt1.src.rpm: build start
2025-Mar-13 22:26:25 :: [x86_64] #40 blueprint-compiler-0.16.0-alt1.src.rpm: build start
[i586]              {setup,configure,dist,install,introspect,init,test,wrap,subprojects,rewrite,compile,devenv,env2mfile,help}
[i586] meson: error: unrecognized arguments: %{subst_enable_meson_bool docs docs}
[i586] error: Bad exit status from /usr/src/tmp/rpm-tmp.9474 (%build)
2025-Mar-13 22:27:07 :: [i586] blueprint-compiler-0.16.0-alt1.src.rpm: remote: build failed
2025-Mar-13 22:27:07 :: [i586] #40 blueprint-compiler-0.16.0-alt1.src.rpm: build FAILED
2025-Mar-13 22:27:07 :: [i586] requesting cancellation of task processing
[x86_64]              {setup,configure,dist,install,introspect,init,test,wrap,subprojects,rewrite,compile,devenv,env2mfile,help}
[x86_64] meson: error: unrecognized arguments: %{subst_enable_meson_bool docs docs}
[x86_64] error: Bad exit status from /usr/src/tmp/rpm-tmp.56789 (%build)
2025-Mar-13 22:27:24 :: [x86_64] blueprint-compiler-0.16.0-alt1.src.rpm: remote: build failed
2025-Mar-13 22:27:24 :: [x86_64] #40 blueprint-compiler-0.16.0-alt1.src.rpm: build FAILED
[aarch64]              {setup,configure,dist,install,introspect,init,test,wrap,subprojects,rewrite,compile,devenv,env2mfile,help}
[aarch64] meson: error: unrecognized arguments: %{subst_enable_meson_bool docs docs}
[aarch64] error: Bad exit status from /usr/src/tmp/rpm-tmp.36522 (%build)
2025-Mar-13 22:27:29 :: [aarch64] blueprint-compiler-0.16.0-alt1.src.rpm: remote: build failed
2025-Mar-13 22:27:29 :: [aarch64] #40 blueprint-compiler-0.16.0-alt1.src.rpm: build FAILED
[armh]              {setup,configure,dist,install,introspect,init,test,wrap,subprojects,rewrite,compile,devenv,env2mfile,help}
[armh] meson: error: unrecognized arguments: %{subst_enable_meson_bool docs docs}
[armh] error: Bad exit status from /usr/src/tmp/rpm-tmp.13740 (%build)
2025-Mar-13 22:27:54 :: [armh] blueprint-compiler-0.16.0-alt1.src.rpm: remote: build failed
2025-Mar-13 22:27:54 :: [armh] #40 blueprint-compiler-0.16.0-alt1.src.rpm: build FAILED
2025-Mar-13 22:27:07 :: [i586] build FAILED
2025-Mar-13 22:27:25 :: [x86_64] build FAILED
2025-Mar-13 22:27:29 :: [aarch64] build FAILED
2025-Mar-13 22:27:54 :: [armh] build FAILED
2025-Mar-13 22:27:54 :: task #377893 for p10 FAILED


More information about the Sisyphus-incominger mailing list