[#377844] [test-only] FAILED alterator-application-systeminfo.git=0.2.2-rc1-alt1

Girar awaiter (sheriffkorov) girar-builder at altlinux.org
Thu Mar 13 15:46:29 MSK 2025


https://git.altlinux.org/tasks/377844/logs/events.1.1.log
https://packages.altlinux.org/tasks/377844

subtask  name                              aarch64    i586  x86_64
   #100  alterator-application-systeminfo   failed  failed  failed

2025-Mar-13 12:46:09 :: test-only task #377844 for sisyphus started by sheriffkorov:
#100 build 0.2.2-rc1-alt1 from /people/sheriffkorov/packages/alterator-application-systeminfo.git fetched at 2025-Mar-13 12:45:59
2025-Mar-13 12:46:10 :: [i586] #100 alterator-application-systeminfo.git 0.2.2-rc1-alt1: build start
2025-Mar-13 12:46:10 :: [x86_64] #100 alterator-application-systeminfo.git 0.2.2-rc1-alt1: build start
2025-Mar-13 12:46:10 :: [aarch64] #100 alterator-application-systeminfo.git 0.2.2-rc1-alt1: build start
[i586] <13>Mar 13 12:46:21 rpmi: rpm-macros-cmake-3.29.1-alt1 sisyphus+344518.300.3.1 1712379787 installed
[i586] <13>Mar 13 12:46:21 rpmi: rpm-macros-alterator-5.4.5-alt1 sisyphus+357097.200.3.1 1725893188 installed
[i586] error: line 4: Invalid symbol '-' (0x2d) in: Version: 0.2.2-rc1
[i586] hsh-rebuild: pkg.tar: failed to fetch build dependencies.
2025-Mar-13 12:46:21 :: [i586] alterator-application-systeminfo.git 0.2.2-rc1-alt1: remote: cannot build src.rpm
2025-Mar-13 12:46:21 :: [i586] #100 alterator-application-systeminfo.git 0.2.2-rc1-alt1: build FAILED
2025-Mar-13 12:46:21 :: [i586] requesting cancellation of task processing
[x86_64] <13>Mar 13 12:46:21 rpmi: rpm-macros-cmake-3.29.1-alt1 sisyphus+344518.300.3.1 1712379787 installed
[x86_64] <13>Mar 13 12:46:21 rpmi: rpm-macros-alterator-5.4.5-alt1 sisyphus+357097.200.3.1 1725893188 installed
[x86_64] error: line 4: Invalid symbol '-' (0x2d) in: Version: 0.2.2-rc1
[x86_64] hsh-rebuild: pkg.tar: failed to fetch build dependencies.
2025-Mar-13 12:46:21 :: [x86_64] alterator-application-systeminfo.git 0.2.2-rc1-alt1: remote: cannot build src.rpm
2025-Mar-13 12:46:21 :: [x86_64] #100 alterator-application-systeminfo.git 0.2.2-rc1-alt1: build FAILED
[aarch64] <13>Mar 13 12:46:28 rpmi: rpm-macros-cmake-3.29.1-alt1 sisyphus+344518.300.3.1 1712379787 installed
[aarch64] <13>Mar 13 12:46:28 rpmi: rpm-macros-alterator-5.4.5-alt1 sisyphus+357097.200.3.1 1725893188 installed
[aarch64] error: line 4: Invalid symbol '-' (0x2d) in: Version: 0.2.2-rc1
[aarch64] hsh-rebuild: pkg.tar: failed to fetch build dependencies.
2025-Mar-13 12:46:29 :: [aarch64] alterator-application-systeminfo.git 0.2.2-rc1-alt1: remote: cannot build src.rpm
2025-Mar-13 12:46:29 :: [aarch64] #100 alterator-application-systeminfo.git 0.2.2-rc1-alt1: build FAILED
2025-Mar-13 12:46:21 :: [i586] build FAILED
2025-Mar-13 12:46:22 :: [x86_64] build FAILED
2025-Mar-13 12:46:29 :: [aarch64] build FAILED
2025-Mar-13 12:46:29 :: task #377844 for sisyphus FAILED


More information about the Sisyphus-incominger mailing list